geronimo-dev mailing list archives

Site index · List index
Message view « Date » · « Thread »
Top « Date » · « Thread »
From ga...@apache.org
Subject [BUILD] branches/2.1: Failed for Revision: 655951
Date Tue, 13 May 2008 19:59:05 GMT
Geronimo Revision: 655951 built with tests included
 
See the full build-1400.log file at http://people.apache.org/builds/geronimo/server/binaries/2.1/20080513/build-1400.log
 
Download the binaries from http://people.apache.org/builds/geronimo/server/binaries/2.1/20080513
[INFO] BUILD SUCCESSFUL
[INFO] ------------------------------------------------------------------------
[INFO] Total time: 31 minutes 25 seconds
[INFO] Finished at: Tue May 13 14:35:36 EDT 2008
[INFO] Final Memory: 306M/1013M
[INFO] ------------------------------------------------------------------------
 
TESTSUITE RESULTS (Failures only)
=================================
See detailed results at http://people.apache.org/builds/geronimo/server/testsuite/ResultsSummary.html
 
Assembly: tomcat
=================================
See the full test.log file at http://people.apache.org/builds/geronimo/server/binaries/2.1/20080513/logs-1400-tomcat/test.log
 
[INFO] Running console-testsuite.advance-test
[INFO] Tests run: 13, Failures: 5, Errors: 0, Skipped: 0, Time elapsed: 56.696 sec <<<
FAILURE!
 
Assembly: jetty
=================================
See the full test.log file at http://people.apache.org/builds/geronimo/server/binaries/2.1/20080513/logs-1400-jetty/test.log
 
[INFO] Running console-testsuite.advance-test
[INFO] Tests run: 13, Failures: 5, Errors: 0, Skipped: 0, Time elapsed: 62.518 sec <<<
FAILURE!
 
Samples: branches/2.1
=================================
Log: http://people.apache.org/builds/geronimo/server/binaries/2.1/20080513/samples-1400.log
 
Build status: FAILED
 

Mime
View raw message