geronimo-dev mailing list archives

Site index · List index
Message view « Date » · « Thread »
Top « Date » · « Thread »
From ga...@apache.org
Subject [BUILD] branches/2.1: Failed for Revision: 655306
Date Sun, 11 May 2008 13:57:30 GMT
Geronimo Revision: 655306 built with tests included
 
See the full build-0800.log file at http://people.apache.org/builds/geronimo/server/binaries/2.1/20080511/build-0800.log
 
Download the binaries from http://people.apache.org/builds/geronimo/server/binaries/2.1/20080511
[INFO] BUILD SUCCESSFUL
[INFO] ------------------------------------------------------------------------
[INFO] Total time: 31 minutes 37 seconds
[INFO] Finished at: Sun May 11 08:36:22 EDT 2008
[INFO] Final Memory: 304M/1014M
[INFO] ------------------------------------------------------------------------
 
TESTSUITE RESULTS (Failures only)
=================================
See detailed results at http://people.apache.org/builds/geronimo/server/testsuite/ResultsSummary.html
 
Assembly: tomcat
=================================
See the full test.log file at http://people.apache.org/builds/geronimo/server/binaries/2.1/20080511/logs-0800-tomcat/test.log
 
[INFO] Running console-testsuite.advance-test
[INFO] Tests run: 13, Failures: 5, Errors: 0, Skipped: 0, Time elapsed: 54.548 sec <<<
FAILURE!
 
Assembly: jetty
=================================
See the full test.log file at http://people.apache.org/builds/geronimo/server/binaries/2.1/20080511/logs-0800-jetty/test.log
 
[INFO] Running console-testsuite.advance-test
[INFO] Tests run: 13, Failures: 5, Errors: 0, Skipped: 0, Time elapsed: 59.257 sec <<<
FAILURE!
 
Samples: branches/2.1
=================================
Log: http://people.apache.org/builds/geronimo/server/binaries/2.1/20080511/samples-0800.log
 
Build status: FAILED
 

Mime
View raw message