geronimo-dev mailing list archives

Site index · List index
Message view « Date » · « Thread »
Top « Date » · « Thread »
From Joe Bohn <joe.b...@earthlink.net>
Subject Re: [BUILD] trunk: Failed for Revision: 646321
Date Wed, 09 Apr 2008 17:08:27 GMT
Jarek Gawor wrote:
> Gianny,
> 
> Can you please take a look at these failures? The tests have been
> failing since your commit on the 5th.
> 
> Jarek

BTW, the same is also true for the smoketests we run for the tck.

Joe



> 
> On Wed, Apr 9, 2008 at 10:48 AM,  <gawor@apache.org> wrote:
>> Geronimo Revision: 646321 built with tests included
>>
>>  See the full build-0900.log file at http://people.apache.org/builds/geronimo/server/binaries/trunk/20080409/build-0900.log
>>
>>  Download the binaries from http://people.apache.org/builds/geronimo/server/binaries/trunk/20080409
>>  [INFO] BUILD SUCCESSFUL
>>  [INFO] ------------------------------------------------------------------------
>>  [INFO] Total time: 46 minutes 6 seconds
>>  [INFO] Finished at: Wed Apr 09 10:12:52 EDT 2008
>>  [INFO] Final Memory: 312M/1013M
>>  [INFO] ------------------------------------------------------------------------
>>
>>  TESTSUITE RESULTS (Failures only)
>>  =================================
>>  See detailed results at http://people.apache.org/builds/geronimo/server/testsuite/ResultsSummary.html
>>
>>  Assembly: tomcat
>>  =================================
>>  See the full test.log file at http://people.apache.org/builds/geronimo/server/binaries/trunk/20080409/logs-0900-tomcat/test.log
>>
>>
>>  [INFO] [INFO] [surefire:test]
>>  [INFO] [INFO] Tests are skipped.
>>  [INFO] [INFO] [surefire:test {execution: test}]
>>  [INFO] [INFO] Tests are skipped.
>>  [INFO] [INFO] [ejb:ejb]
>>  [INFO] [INFO] Building ejb corba-marshal-ejb-2.2-SNAPSHOT with ejbVersion 2.1
>>  [INFO] [INFO] Building jar: /home/geronimo/geronimo/trunk/testsuite/corba-testsuite/corba-marshal/corba-marshal-ejb/target/corba-marshal-ejb-2.2-SNAPSHOT.jar
>>  [INFO] [INFO] [surefire:test {execution: integration}]
>>  [INFO] [INFO] No tests to run.
>>  [INFO] [INFO] [tools:verify-legal-files {execution: verify-legal-files}]
>>  [INFO] [INFO] Checking legal files in: corba-marshal-ejb-2.2-SNAPSHOT.jar
>>  [INFO] [INFO] [install:install]
>>  [INFO] [INFO] Installing /home/geronimo/geronimo/trunk/testsuite/corba-testsuite/corba-marshal/corba-marshal-ejb/target/corba-marshal-ejb-2.2-SNAPSHOT.jar
to /home/geronimo/.m2/repository/org/apache/geronimo/testsuite/corba-marshal-ejb/2.2-SNAPSHOT/corba-marshal-ejb-2.2-SNAPSHOT.jar
>>  [INFO] [INFO] [testsuite:generate-surefire-xml {execution: generate-surefire-xml}]
>>  [INFO] [INFO] Updating directory: /home/geronimo/geronimo/trunk/testsuite/corba-testsuite/corba-marshal/target/surefire-reports
>>  [INFO] [INFO] No surefire-reports directory here
>>  [INFO] [INFO] ----------------------------------------------------------------------------
>>  [INFO] [INFO] Building Geronimo TestSuite :: CORBA TestSuite :: Marshal Client
>>  [INFO] [INFO]    task-segment: [install]
>>  [INFO] [INFO] ----------------------------------------------------------------------------
>>  [INFO] [INFO] [enforcer:enforce {execution: default}]
>>  [INFO] [INFO] [tools:copy-legal-files {execution: install-legal-files}]
>>  [INFO] [INFO] Created dir: /home/geronimo/geronimo/trunk/testsuite/corba-testsuite/corba-marshal/corba-marshal-client/target/classes/META-INF
>>  [INFO] [INFO] Copying 2 files to /home/geronimo/geronimo/trunk/testsuite/corba-testsuite/corba-marshal/corba-marshal-client/target/classes/META-INF
>>  [INFO] [INFO] [resources:resources]
>>  [INFO] [INFO] Using default encoding to copy filtered resources.
>>  [INFO] [INFO] [compiler:compile]
>>  [INFO] [INFO] Compiling 6 source files to /home/geronimo/geronimo/trunk/testsuite/corba-testsuite/corba-marshal/corba-marshal-client/target/classes
>>  [INFO] [INFO] [resources:testResources]
>>  [INFO] [INFO] Using default encoding to copy filtered resources.
>>  [INFO] [INFO] [compiler:testCompile]
>>  [INFO] [INFO] No sources to compile
>>  [INFO] [INFO] [surefire:test]
>>  [INFO] [INFO] Tests are skipped.
>>  [INFO] [INFO] [surefire:test {execution: test}]
>>  [INFO] [INFO] Tests are skipped.
>>  [INFO] [INFO] [jar:jar]
>>  [INFO] [INFO] Building jar: /home/geronimo/geronimo/trunk/testsuite/corba-testsuite/corba-marshal/corba-marshal-client/target/corba-marshal-client-2.2-SNAPSHOT.jar
>>  [INFO] [INFO] [surefire:test {execution: integration}]
>>  [INFO] [INFO] No tests to run.
>>  [INFO] [INFO] [tools:verify-legal-files {execution: verify-legal-files}]
>>  [INFO] [INFO] Checking legal files in: corba-marshal-client-2.2-SNAPSHOT.jar
>>  [INFO] [INFO] [install:install]
>>  [INFO] [INFO] Installing /home/geronimo/geronimo/trunk/testsuite/corba-testsuite/corba-marshal/corba-marshal-client/target/corba-marshal-client-2.2-SNAPSHOT.jar
to /home/geronimo/.m2/repository/org/apache/geronimo/testsuite/corba-marshal-client/2.2-SNAPSHOT/corba-marshal-client-2.2-SNAPSHOT.jar
>>  [INFO] [INFO] [testsuite:generate-surefire-xml {execution: generate-surefire-xml}]
>>  [INFO] [INFO] Updating directory: /home/geronimo/geronimo/trunk/testsuite/corba-testsuite/corba-marshal/target/surefire-reports
>>  [INFO] [INFO] No surefire-reports directory here
>>  [INFO] [INFO] ----------------------------------------------------------------------------
>>  [INFO] [INFO] Building Geronimo TestSuite :: CORBA TestSuite :: Marshal EAR
>>  [INFO] [INFO]    task-segment: [install]
>>  [INFO] [INFO] ----------------------------------------------------------------------------
>>  [INFO] [INFO] [enforcer:enforce {execution: default}]
>>  [INFO] [INFO] [ear:generate-application-xml]
>>  [INFO] [INFO] Generating application.xml
>>  [INFO] [INFO] [tools:copy-legal-files {execution: install-legal-files}]
>>  [INFO] [INFO] Created dir: /home/geronimo/geronimo/trunk/testsuite/corba-testsuite/corba-marshal/corba-marshal-ear/target/classes/META-INF
>>  [INFO] [INFO] Copying 2 files to /home/geronimo/geronimo/trunk/testsuite/corba-testsuite/corba-marshal/corba-marshal-ear/target/classes/META-INF
>>  [INFO] [INFO] [resources:resources]
>>  [INFO] [INFO] Using default encoding to copy filtered resources.
>>  [INFO] [INFO] [ear:ear]
>>  [INFO] [INFO] Copying artifact[ejb:org.apache.geronimo.testsuite:corba-marshal-ejb:2.2-SNAPSHOT]
to[corba-marshal-ejb-2.2-SNAPSHOT.jar]
>>  [INFO] [INFO] Copying artifact[jar:org.apache.geronimo.testsuite:corba-marshal-client:2.2-SNAPSHOT]
to[corba-marshal-client-2.2-SNAPSHOT.jar]
>>  [INFO] [INFO] Copy ear resources to /home/geronimo/geronimo/trunk/testsuite/corba-testsuite/corba-marshal/corba-marshal-ear/target/corba-marshal-ear-2.2-SNAPSHOT
>>  [INFO] [INFO] Could not find manifest file: /home/geronimo/geronimo/trunk/testsuite/corba-testsuite/corba-marshal/corba-marshal-ear/src/main/application/META-INF/MANIFEST.MF
- Generating one
>>  [INFO] [INFO] Building jar: /home/geronimo/geronimo/trunk/testsuite/corba-testsuite/corba-marshal/corba-marshal-ear/target/corba-marshal-ear-2.2-SNAPSHOT.ear
>>  [INFO] Downloading: http://download.java.net/maven/1//woodstox/poms/wstx-asl-3.2.1.pom
>>  [INFO] Downloading: http://people.apache.org/repo/m2-incubating-repository//woodstox/wstx-asl/3.2.1/wstx-asl-3.2.1.pom
>>  [INFO] Downloading: http://repo1.maven.org/maven2/woodstox/wstx-asl/3.2.1/wstx-asl-3.2.1.pom
>>  [INFO] Downloading: http://download.java.net/maven/1//woodstox/poms/wstx-asl-3.2.1.pom
>>  [INFO] Downloading: http://people.apache.org/repo/m2-incubating-repository//woodstox/wstx-asl/3.2.1/wstx-asl-3.2.1.pom
>>  [INFO] Downloading: http://repo1.maven.org/maven2/woodstox/wstx-asl/3.2.1/wstx-asl-3.2.1.pom
>>  [INFO] [INFO] [geronimo:start-module {execution: start-j2ee-corba-yoko}]
>>  [INFO] [INFO] Using non-artifact based module id: org.apache.geronimo.configs/j2ee-corba-yoko/2.2-SNAPSHOT/car
>>  [WARNING] log4j:WARN No appenders could be found for logger (org.apache.geronimo.deployment.plugin.factories.BaseDeploymentFactory).
>>  [WARNING] log4j:WARN Please initialize the log4j system properly.
>>  [INFO] [WARNING] Module is already started: org.apache.geronimo.configs/j2ee-corba-yoko/2.2-SNAPSHOT/car
>>  [INFO] [INFO] [geronimo:start-module {execution: openejb-corba-deployer}]
>>  [INFO] [INFO] Using non-artifact based module id: org.apache.geronimo.configs/openejb-corba-deployer/2.2-SNAPSHOT/car
>>  [INFO] [WARNING] Module is already started: org.apache.geronimo.configs/openejb-corba-deployer/2.2-SNAPSHOT/car
>>  [INFO] [INFO] [geronimo:deploy-module {execution: deploy-ear}]
>>  [INFO] [INFO] Using non-artifact based module archive: /home/geronimo/geronimo/trunk/testsuite/corba-testsuite/corba-marshal/corba-marshal-ear/target/corba-marshal-ear-2.2-SNAPSHOT.ear
>>  [INFO] [INFO] Using non-artifact based plan: null
>>  [INFO] [INFO] Distributing module artifact: /home/geronimo/geronimo/trunk/testsuite/corba-testsuite/corba-marshal/corba-marshal-ear/target/corba-marshal-ear-2.2-SNAPSHOT.ear
with plan null
>>  [INFO] [INFO] Starting modules...
>>  [INFO] [INFO] Starting module: org.apache.geronimo.testsuite/corba-marshal-ear/2.2-SNAPSHOT/car
>>  [INFO] [INFO] Started module(s):
>>  [INFO] [INFO]     [0] org.apache.geronimo.testsuite/corba-marshal-ear/2.2-SNAPSHOT/car
>>  [INFO] [INFO]         [0] org.apache.geronimo.testsuite/corba-marshal-client/2.2-SNAPSHOT/car
>>  [INFO] [INFO] [geronimo:run-client {execution: run-client}]
>>  [INFO] [INFO] Geronimo Home: /home/geronimo/geronimo/trunk/testsuite/corba-testsuite/target/geronimo-tomcat6-javaee5-2.2-SNAPSHOT
>>  [INFO] [INFO] Starting Geronimo client...
>>  [INFO] [WARNING] Exception in thread "main" java.lang.NoClassDefFoundError: org/apache/xbean/recipe/ConstructionException
>>  [INFO] [WARNING]        at org.apache.geronimo.kernel.basic.BasicKernel.loadGBean(BasicKernel.java:354)
>>  [INFO] [WARNING]        at org.apache.geronimo.kernel.basic.BasicKernel.boot(BasicKernel.java:610)
>>  [INFO] [WARNING]        at org.apache.geronimo.kernel.util.MainConfigurationBootstrapper.bootKernel(MainConfigurationBootstrapper.java:72)
>>  [INFO] [WARNING]        at org.apache.geronimo.kernel.util.MainConfigurationBootstrapper.getMain(MainConfigurationBootstrapper.java:56)
>>  [INFO] [WARNING]        at org.apache.geronimo.kernel.util.MainConfigurationBootstrapper.main(MainConfigurationBootstrapper.java:38)
>>  [INFO] [WARNING]        at org.apache.geronimo.cli.AbstractCLI.executeMain(AbstractCLI.java:67)
>>  [INFO] [WARNING]        at org.apache.geronimo.cli.client.ClientCLI.main(ClientCLI.java:30)
>>  [INFO] [INFO] ------------------------------------------------------------------------
>>  [INFO] [ERROR] BUILD ERROR
>>  [INFO] [INFO] ------------------------------------------------------------------------
>>  [INFO] [INFO] Java returned: 1
>>  [INFO]
>>  [INFO] [INFO] ------------------------------------------------------------------------
>>  [INFO] [INFO] Trace
>>  [INFO] org.apache.maven.lifecycle.LifecycleExecutionException: Java returned: 1
>>  [INFO]  at org.apache.maven.lifecycle.DefaultLifecycleExecutor.executeGoals(DefaultLifecycleExecutor.java:564)
>>  [INFO]  at org.apache.maven.lifecycle.DefaultLifecycleExecutor.executeGoalWithLifecycle(DefaultLifecycleExecutor.java:480)
>>  [INFO]  at org.apache.maven.lifecycle.DefaultLifecycleExecutor.executeGoal(DefaultLifecycleExecutor.java:459)
>>  [INFO]  at org.apache.maven.lifecycle.DefaultLifecycleExecutor.executeGoalAndHandleFailures(DefaultLifecycleExecutor.java:311)
>>  [INFO]  at org.apache.maven.lifecycle.DefaultLifecycleExecutor.executeTaskSegments(DefaultLifecycleExecutor.java:278)
>>  [INFO]  at org.apache.maven.lifecycle.DefaultLifecycleExecutor.execute(DefaultLifecycleExecutor.java:143)
>>  [INFO]  at org.apache.maven.DefaultMaven.doExecute(DefaultMaven.java:334)
>>  [INFO]  at org.apache.maven.DefaultMaven.execute(DefaultMaven.java:125)
>>  [INFO]  at org.apache.maven.cli.MavenCli.main(MavenCli.java:280)
>>  [INFO]  at sun.reflect.NativeMethodAccessorImpl.invoke0(Native Method)
>>  [INFO]  at sun.reflect.NativeMethodAccessorImpl.invoke(NativeMethodAccessorImpl.java:39)
>>  [INFO]  at sun.reflect.DelegatingMethodAccessorImpl.invoke(DelegatingMethodAccessorImpl.java:25)
>>  [INFO]  at java.lang.reflect.Method.invoke(Method.java:585)
>>  [INFO]  at org.codehaus.classworlds.Launcher.launchEnhanced(Launcher.java:315)
>>  [INFO]  at org.codehaus.classworlds.Launcher.launch(Launcher.java:255)
>>  [INFO]  at org.codehaus.classworlds.Launcher.mainWithExitCode(Launcher.java:430)
>>  [INFO]  at org.codehaus.classworlds.Launcher.main(Launcher.java:375)
>>  [INFO] Caused by: org.apache.maven.plugin.MojoExecutionException: Java returned:
1
>>  [INFO]  at org.apache.geronimo.mavenplugins.geronimo.reporting.ReportingMojoSupport.execute(ReportingMojoSupport.java:114)
>>  [INFO]  at org.apache.maven.plugin.DefaultPluginManager.executeMojo(DefaultPluginManager.java:443)
>>  [INFO]  at org.apache.maven.lifecycle.DefaultLifecycleExecutor.executeGoals(DefaultLifecycleExecutor.java:539)
>>  [INFO]  ... 16 more
>>  [INFO] Caused by: Java returned: 1
>>  [INFO]  at org.apache.tools.ant.taskdefs.Java.execute(Java.java:87)
>>  [INFO]  at org.apache.geronimo.mavenplugins.geronimo.server.RunClientMojo.doExecute(RunClientMojo.java:143)
>>  [INFO]  at org.apache.geronimo.mavenplugins.geronimo.reporting.ReportingMojoSupport.execute(ReportingMojoSupport.java:99)
>>  [INFO]  ... 18 more
>>  [INFO] [INFO] ------------------------------------------------------------------------
>>  [INFO] [INFO] Total time: 22 seconds
>>  [INFO] [INFO] Finished at: Wed Apr 09 10:24:24 EDT 2008
>>  [INFO] [INFO] Final Memory: 26M/554M
>>  [INFO] [INFO] ------------------------------------------------------------------------
>>  [INFO] ------------------------------------------------------------------------
>>  [ERROR] BUILD ERROR
>>
>>  Assembly: jetty
>>  =================================
>>  See the full test.log file at http://people.apache.org/builds/geronimo/server/binaries/trunk/20080409/logs-0900-jetty/test.log
>>
>>  [INFO] Running console-testsuite.advance-test
>>  [INFO] Tests run: 13, Failures: 1, Errors: 0, Skipped: 0, Time elapsed: 74.687 sec
<<< FAILURE!
>>
>>  [INFO] [INFO] [surefire:test]
>>  [INFO] [INFO] Tests are skipped.
>>  [INFO] [INFO] [surefire:test {execution: test}]
>>  [INFO] [INFO] Tests are skipped.
>>  [INFO] [INFO] [ejb:ejb]
>>  [INFO] [INFO] Building ejb corba-marshal-ejb-2.2-SNAPSHOT with ejbVersion 2.1
>>  [INFO] [INFO] Building jar: /home/geronimo/geronimo/trunk/testsuite/corba-testsuite/corba-marshal/corba-marshal-ejb/target/corba-marshal-ejb-2.2-SNAPSHOT.jar
>>  [INFO] [INFO] [surefire:test {execution: integration}]
>>  [INFO] [INFO] No tests to run.
>>  [INFO] [INFO] [tools:verify-legal-files {execution: verify-legal-files}]
>>  [INFO] [INFO] Checking legal files in: corba-marshal-ejb-2.2-SNAPSHOT.jar
>>  [INFO] [INFO] [install:install]
>>  [INFO] [INFO] Installing /home/geronimo/geronimo/trunk/testsuite/corba-testsuite/corba-marshal/corba-marshal-ejb/target/corba-marshal-ejb-2.2-SNAPSHOT.jar
to /home/geronimo/.m2/repository/org/apache/geronimo/testsuite/corba-marshal-ejb/2.2-SNAPSHOT/corba-marshal-ejb-2.2-SNAPSHOT.jar
>>  [INFO] [INFO] [testsuite:generate-surefire-xml {execution: generate-surefire-xml}]
>>  [INFO] [INFO] Updating directory: /home/geronimo/geronimo/trunk/testsuite/corba-testsuite/corba-marshal/target/surefire-reports
>>  [INFO] [INFO] No surefire-reports directory here
>>  [INFO] [INFO] ----------------------------------------------------------------------------
>>  [INFO] [INFO] Building Geronimo TestSuite :: CORBA TestSuite :: Marshal Client
>>  [INFO] [INFO]    task-segment: [install]
>>  [INFO] [INFO] ----------------------------------------------------------------------------
>>  [INFO] [INFO] [enforcer:enforce {execution: default}]
>>  [INFO] [INFO] [tools:copy-legal-files {execution: install-legal-files}]
>>  [INFO] [INFO] Created dir: /home/geronimo/geronimo/trunk/testsuite/corba-testsuite/corba-marshal/corba-marshal-client/target/classes/META-INF
>>  [INFO] [INFO] Copying 2 files to /home/geronimo/geronimo/trunk/testsuite/corba-testsuite/corba-marshal/corba-marshal-client/target/classes/META-INF
>>  [INFO] [INFO] [resources:resources]
>>  [INFO] [INFO] Using default encoding to copy filtered resources.
>>  [INFO] [INFO] [compiler:compile]
>>  [INFO] [INFO] Compiling 6 source files to /home/geronimo/geronimo/trunk/testsuite/corba-testsuite/corba-marshal/corba-marshal-client/target/classes
>>  [INFO] [INFO] [resources:testResources]
>>  [INFO] [INFO] Using default encoding to copy filtered resources.
>>  [INFO] [INFO] [compiler:testCompile]
>>  [INFO] [INFO] No sources to compile
>>  [INFO] [INFO] [surefire:test]
>>  [INFO] [INFO] Tests are skipped.
>>  [INFO] [INFO] [surefire:test {execution: test}]
>>  [INFO] [INFO] Tests are skipped.
>>  [INFO] [INFO] [jar:jar]
>>  [INFO] [INFO] Building jar: /home/geronimo/geronimo/trunk/testsuite/corba-testsuite/corba-marshal/corba-marshal-client/target/corba-marshal-client-2.2-SNAPSHOT.jar
>>  [INFO] [INFO] [surefire:test {execution: integration}]
>>  [INFO] [INFO] No tests to run.
>>  [INFO] [INFO] [tools:verify-legal-files {execution: verify-legal-files}]
>>  [INFO] [INFO] Checking legal files in: corba-marshal-client-2.2-SNAPSHOT.jar
>>  [INFO] [INFO] [install:install]
>>  [INFO] [INFO] Installing /home/geronimo/geronimo/trunk/testsuite/corba-testsuite/corba-marshal/corba-marshal-client/target/corba-marshal-client-2.2-SNAPSHOT.jar
to /home/geronimo/.m2/repository/org/apache/geronimo/testsuite/corba-marshal-client/2.2-SNAPSHOT/corba-marshal-client-2.2-SNAPSHOT.jar
>>  [INFO] [INFO] [testsuite:generate-surefire-xml {execution: generate-surefire-xml}]
>>  [INFO] [INFO] Updating directory: /home/geronimo/geronimo/trunk/testsuite/corba-testsuite/corba-marshal/target/surefire-reports
>>  [INFO] [INFO] No surefire-reports directory here
>>  [INFO] [INFO] ----------------------------------------------------------------------------
>>  [INFO] [INFO] Building Geronimo TestSuite :: CORBA TestSuite :: Marshal EAR
>>  [INFO] [INFO]    task-segment: [install]
>>  [INFO] [INFO] ----------------------------------------------------------------------------
>>  [INFO] [INFO] [enforcer:enforce {execution: default}]
>>  [INFO] [INFO] [ear:generate-application-xml]
>>  [INFO] [INFO] Generating application.xml
>>  [INFO] [INFO] [tools:copy-legal-files {execution: install-legal-files}]
>>  [INFO] [INFO] Created dir: /home/geronimo/geronimo/trunk/testsuite/corba-testsuite/corba-marshal/corba-marshal-ear/target/classes/META-INF
>>  [INFO] [INFO] Copying 2 files to /home/geronimo/geronimo/trunk/testsuite/corba-testsuite/corba-marshal/corba-marshal-ear/target/classes/META-INF
>>  [INFO] [INFO] [resources:resources]
>>  [INFO] [INFO] Using default encoding to copy filtered resources.
>>  [INFO] [INFO] [ear:ear]
>>  [INFO] [INFO] Copying artifact[ejb:org.apache.geronimo.testsuite:corba-marshal-ejb:2.2-SNAPSHOT]
to[corba-marshal-ejb-2.2-SNAPSHOT.jar]
>>  [INFO] [INFO] Copying artifact[jar:org.apache.geronimo.testsuite:corba-marshal-client:2.2-SNAPSHOT]
to[corba-marshal-client-2.2-SNAPSHOT.jar]
>>  [INFO] [INFO] Copy ear resources to /home/geronimo/geronimo/trunk/testsuite/corba-testsuite/corba-marshal/corba-marshal-ear/target/corba-marshal-ear-2.2-SNAPSHOT
>>  [INFO] [INFO] Could not find manifest file: /home/geronimo/geronimo/trunk/testsuite/corba-testsuite/corba-marshal/corba-marshal-ear/src/main/application/META-INF/MANIFEST.MF
- Generating one
>>  [INFO] [INFO] Building jar: /home/geronimo/geronimo/trunk/testsuite/corba-testsuite/corba-marshal/corba-marshal-ear/target/corba-marshal-ear-2.2-SNAPSHOT.ear
>>  [INFO] Downloading: http://download.java.net/maven/1//woodstox/poms/wstx-asl-3.2.1.pom
>>  [INFO] Downloading: http://people.apache.org/repo/m2-incubating-repository//woodstox/wstx-asl/3.2.1/wstx-asl-3.2.1.pom
>>  [INFO] Downloading: http://repo1.maven.org/maven2/woodstox/wstx-asl/3.2.1/wstx-asl-3.2.1.pom
>>  [INFO] Downloading: http://download.java.net/maven/1//woodstox/poms/wstx-asl-3.2.1.pom
>>  [INFO] Downloading: http://people.apache.org/repo/m2-incubating-repository//woodstox/wstx-asl/3.2.1/wstx-asl-3.2.1.pom
>>  [INFO] Downloading: http://repo1.maven.org/maven2/woodstox/wstx-asl/3.2.1/wstx-asl-3.2.1.pom
>>  [INFO] [INFO] [geronimo:start-module {execution: start-j2ee-corba-yoko}]
>>  [INFO] [INFO] Using non-artifact based module id: org.apache.geronimo.configs/j2ee-corba-yoko/2.2-SNAPSHOT/car
>>  [WARNING] log4j:WARN No appenders could be found for logger (org.apache.geronimo.deployment.plugin.factories.BaseDeploymentFactory).
>>  [WARNING] log4j:WARN Please initialize the log4j system properly.
>>  [INFO] [WARNING] Module is already started: org.apache.geronimo.configs/j2ee-corba-yoko/2.2-SNAPSHOT/car
>>  [INFO] [INFO] [geronimo:start-module {execution: openejb-corba-deployer}]
>>  [INFO] [INFO] Using non-artifact based module id: org.apache.geronimo.configs/openejb-corba-deployer/2.2-SNAPSHOT/car
>>  [INFO] [WARNING] Module is already started: org.apache.geronimo.configs/openejb-corba-deployer/2.2-SNAPSHOT/car
>>  [INFO] [INFO] [geronimo:deploy-module {execution: deploy-ear}]
>>  [INFO] [INFO] Using non-artifact based module archive: /home/geronimo/geronimo/trunk/testsuite/corba-testsuite/corba-marshal/corba-marshal-ear/target/corba-marshal-ear-2.2-SNAPSHOT.ear
>>  [INFO] [INFO] Using non-artifact based plan: null
>>  [INFO] [INFO] Distributing module artifact: /home/geronimo/geronimo/trunk/testsuite/corba-testsuite/corba-marshal/corba-marshal-ear/target/corba-marshal-ear-2.2-SNAPSHOT.ear
with plan null
>>  [INFO] [INFO] Starting modules...
>>  [INFO] [INFO] Starting module: org.apache.geronimo.testsuite/corba-marshal-ear/2.2-SNAPSHOT/car
>>  [INFO] [INFO] Started module(s):
>>  [INFO] [INFO]     [0] org.apache.geronimo.testsuite/corba-marshal-ear/2.2-SNAPSHOT/car
>>  [INFO] [INFO]         [0] org.apache.geronimo.testsuite/corba-marshal-client/2.2-SNAPSHOT/car
>>  [INFO] [INFO] [geronimo:run-client {execution: run-client}]
>>  [INFO] [INFO] Geronimo Home: /home/geronimo/geronimo/trunk/testsuite/corba-testsuite/target/geronimo-jetty6-javaee5-2.2-SNAPSHOT
>>  [INFO] [INFO] Starting Geronimo client...
>>  [INFO] [WARNING] Exception in thread "main" java.lang.NoClassDefFoundError: org/apache/xbean/recipe/ConstructionException
>>  [INFO] [WARNING]        at org.apache.geronimo.kernel.basic.BasicKernel.loadGBean(BasicKernel.java:354)
>>  [INFO] [WARNING]        at org.apache.geronimo.kernel.basic.BasicKernel.boot(BasicKernel.java:610)
>>  [INFO] [WARNING]        at org.apache.geronimo.kernel.util.MainConfigurationBootstrapper.bootKernel(MainConfigurationBootstrapper.java:72)
>>  [INFO] [WARNING]        at org.apache.geronimo.kernel.util.MainConfigurationBootstrapper.getMain(MainConfigurationBootstrapper.java:56)
>>  [INFO] [WARNING]        at org.apache.geronimo.kernel.util.MainConfigurationBootstrapper.main(MainConfigurationBootstrapper.java:38)
>>  [INFO] [WARNING]        at org.apache.geronimo.cli.AbstractCLI.executeMain(AbstractCLI.java:67)
>>  [INFO] [WARNING]        at org.apache.geronimo.cli.client.ClientCLI.main(ClientCLI.java:30)
>>  [INFO] [INFO] ------------------------------------------------------------------------
>>  [INFO] [ERROR] BUILD ERROR
>>  [INFO] [INFO] ------------------------------------------------------------------------
>>  [INFO] [INFO] Java returned: 1
>>  [INFO]
>>  [INFO] [INFO] ------------------------------------------------------------------------
>>  [INFO] [INFO] Trace
>>  [INFO] org.apache.maven.lifecycle.LifecycleExecutionException: Java returned: 1
>>  [INFO]  at org.apache.maven.lifecycle.DefaultLifecycleExecutor.executeGoals(DefaultLifecycleExecutor.java:564)
>>  [INFO]  at org.apache.maven.lifecycle.DefaultLifecycleExecutor.executeGoalWithLifecycle(DefaultLifecycleExecutor.java:480)
>>  [INFO]  at org.apache.maven.lifecycle.DefaultLifecycleExecutor.executeGoal(DefaultLifecycleExecutor.java:459)
>>  [INFO]  at org.apache.maven.lifecycle.DefaultLifecycleExecutor.executeGoalAndHandleFailures(DefaultLifecycleExecutor.java:311)
>>  [INFO]  at org.apache.maven.lifecycle.DefaultLifecycleExecutor.executeTaskSegments(DefaultLifecycleExecutor.java:278)
>>  [INFO]  at org.apache.maven.lifecycle.DefaultLifecycleExecutor.execute(DefaultLifecycleExecutor.java:143)
>>  [INFO]  at org.apache.maven.DefaultMaven.doExecute(DefaultMaven.java:334)
>>  [INFO]  at org.apache.maven.DefaultMaven.execute(DefaultMaven.java:125)
>>  [INFO]  at org.apache.maven.cli.MavenCli.main(MavenCli.java:280)
>>  [INFO]  at sun.reflect.NativeMethodAccessorImpl.invoke0(Native Method)
>>  [INFO]  at sun.reflect.NativeMethodAccessorImpl.invoke(NativeMethodAccessorImpl.java:39)
>>  [INFO]  at sun.reflect.DelegatingMethodAccessorImpl.invoke(DelegatingMethodAccessorImpl.java:25)
>>  [INFO]  at java.lang.reflect.Method.invoke(Method.java:585)
>>  [INFO]  at org.codehaus.classworlds.Launcher.launchEnhanced(Launcher.java:315)
>>  [INFO]  at org.codehaus.classworlds.Launcher.launch(Launcher.java:255)
>>  [INFO]  at org.codehaus.classworlds.Launcher.mainWithExitCode(Launcher.java:430)
>>  [INFO]  at org.codehaus.classworlds.Launcher.main(Launcher.java:375)
>>  [INFO] Caused by: org.apache.maven.plugin.MojoExecutionException: Java returned:
1
>>  [INFO]  at org.apache.geronimo.mavenplugins.geronimo.reporting.ReportingMojoSupport.execute(ReportingMojoSupport.java:114)
>>  [INFO]  at org.apache.maven.plugin.DefaultPluginManager.executeMojo(DefaultPluginManager.java:443)
>>  [INFO]  at org.apache.maven.lifecycle.DefaultLifecycleExecutor.executeGoals(DefaultLifecycleExecutor.java:539)
>>  [INFO]  ... 16 more
>>  [INFO] Caused by: Java returned: 1
>>  [INFO]  at org.apache.tools.ant.taskdefs.Java.execute(Java.java:87)
>>  [INFO]  at org.apache.geronimo.mavenplugins.geronimo.server.RunClientMojo.doExecute(RunClientMojo.java:143)
>>  [INFO]  at org.apache.geronimo.mavenplugins.geronimo.reporting.ReportingMojoSupport.execute(ReportingMojoSupport.java:99)
>>  [INFO]  ... 18 more
>>  [INFO] [INFO] ------------------------------------------------------------------------
>>  [INFO] [INFO] Total time: 23 seconds
>>  [INFO] [INFO] Finished at: Wed Apr 09 10:36:03 EDT 2008
>>  [INFO] [INFO] Final Memory: 26M/550M
>>  [INFO] [INFO] ------------------------------------------------------------------------
>>  [INFO] ------------------------------------------------------------------------
>>  [ERROR] BUILD ERROR
>>
>>  Samples: trunk
>>  =================================
>>  Log: http://people.apache.org/builds/geronimo/server/binaries/trunk/20080409/samples-0900.log
>>
>>  Build status: FAILED
>>
>>
> 


Mime
View raw message