geronimo-dev mailing list archives

Site index · List index
Message view « Date » · « Thread »
Top « Date » · « Thread »
From ga...@apache.org
Subject [BUILD] 2.1.1: Failed for Revision: 631674
Date Wed, 27 Feb 2008 20:31:49 GMT
Geronimo Revision: 631674 built with tests included
 
See the full build-1400.log file at http://geronimo.apache.org/maven/server/binaries/2.1/20080227/build-1400.log
 
Download the binaries from http://geronimo.apache.org/maven/server/binaries/2.1/20080227
[INFO] BUILD SUCCESSFUL
[INFO] ------------------------------------------------------------------------
[INFO] Total time: 32 minutes 2 seconds
[INFO] Finished at: Wed Feb 27 14:46:30 EST 2008
[INFO] Final Memory: 298M/1012M
[INFO] ------------------------------------------------------------------------
 
TESTSUITE RESULTS (Failures only)
=================================
See detailed results at http://geronimo.apache.org/maven/server/testsuite/ResultsSummary.html
 
Assembly: tomcat
=================================
See the full test.log file at http://geronimo.apache.org/maven/server/binaries/2.1/20080227/logs-1400-tomcat/test.log
 
[INFO] Running console-testsuite.advance-test
[INFO] Tests run: 13, Failures: 1, Errors: 0, Skipped: 0, Time elapsed: 65.093 sec <<<
FAILURE!
--
[INFO] Running web-testsuite.forward
[INFO] Tests run: 1, Failures: 1, Errors: 0, Skipped: 0, Time elapsed: 0.701 sec <<<
FAILURE!
[INFO] Running web-testsuite.myfaces
[INFO] Tests run: 1, Failures: 1, Errors: 0, Skipped: 0, Time elapsed: 0.354 sec <<<
FAILURE!
[INFO] Running web-testsuite.tomcat
[INFO] Tests run: 2, Failures: 2, Errors: 0, Skipped: 0, Time elapsed: 0.079 sec <<<
FAILURE!
[INFO] Running web-testsuite.references
[INFO] Tests run: 1, Failures: 1, Errors: 0, Skipped: 0, Time elapsed: 0.302 sec <<<
FAILURE!
[INFO] Running web-testsuite.servlets
[INFO] Tests run: 2, Failures: 2, Errors: 0, Skipped: 0, Time elapsed: 0.536 sec <<<
FAILURE!
 
[INFO] [INFO] Created dir: /home/geronimo/geronimo/2.1/testsuite/web-testsuite/test-2.5-servlets/target/classes/META-INF
[INFO] [INFO] Copying 2 files to /home/geronimo/geronimo/2.1/testsuite/web-testsuite/test-2.5-servlets/target/classes/META-INF
[INFO] [INFO] [resources:resources]
[INFO] [INFO] Using default encoding to copy filtered resources.
[INFO] [INFO] [compiler:compile]
[INFO] [INFO] Compiling 3 source files to /home/geronimo/geronimo/2.1/testsuite/web-testsuite/test-2.5-servlets/target/classes
[INFO] [INFO] [resources:testResources]
[INFO] [INFO] Using default encoding to copy filtered resources.
[INFO] [INFO] [compiler:testCompile]
[INFO] [INFO] Compiling 1 source file to /home/geronimo/geronimo/2.1/testsuite/web-testsuite/test-2.5-servlets/target/test-classes
[INFO] [INFO] [surefire:test]
[INFO] [INFO] Tests are skipped.
[INFO] [INFO] [surefire:test {execution: test}]
[INFO] [INFO] Tests are skipped.
[INFO] [INFO] [war:war]
[INFO] [INFO] Exploding webapp...
[INFO] [INFO] Assembling webapp test-2.5-servlets in /home/geronimo/geronimo/2.1/testsuite/web-testsuite/test-2.5-servlets/target/test-2.5-servlets-2.1.1-SNAPSHOT
[INFO] [INFO] Copy webapp webResources to /home/geronimo/geronimo/2.1/testsuite/web-testsuite/test-2.5-servlets/target/test-2.5-servlets-2.1.1-SNAPSHOT
[INFO] [INFO] Copy webapp webResources to /home/geronimo/geronimo/2.1/testsuite/web-testsuite/test-2.5-servlets/target/test-2.5-servlets-2.1.1-SNAPSHOT
[INFO] [INFO] Copy webapp webResources to /home/geronimo/geronimo/2.1/testsuite/web-testsuite/test-2.5-servlets/target/test-2.5-servlets-2.1.1-SNAPSHOT
[INFO] [INFO] Building jar: /home/geronimo/geronimo/2.1/testsuite/web-testsuite/test-2.5-servlets/target/test-2.5-servlets-2.1.1-SNAPSHOT/WEB-INF/lib/test-2.5-servlets-2.1.1-SNAPSHOT.jar
[INFO] [INFO] Generating war /home/geronimo/geronimo/2.1/testsuite/web-testsuite/test-2.5-servlets/target/test-2.5-servlets-2.1.1-SNAPSHOT.war
[INFO] [INFO] Building war: /home/geronimo/geronimo/2.1/testsuite/web-testsuite/test-2.5-servlets/target/test-2.5-servlets-2.1.1-SNAPSHOT.war
[INFO] [INFO] [selenium:start-server {execution: start-server}]
[INFO] [INFO] Starting Selenium server...
[INFO] [INFO] Created dir: /home/geronimo/geronimo/2.1/testsuite/web-testsuite/test-2.5-servlets/target/selenium
[INFO] Launching Selenium Server
[INFO] Waiting for Selenium Server...
[INFO] Selenium Server started
[INFO] [WARNING] OS appears to be Unix and no DISPLAY environment variable has been detected.
Browser maybe unable to function correctly. Consider using the selenium:xvfb goal to enable
headless operation.
[INFO] [INFO] Redirecting output to: /home/geronimo/geronimo/2.1/testsuite/web-testsuite/test-2.5-servlets/target/selenium/server.log
[INFO] [INFO] User extensions: /home/geronimo/geronimo/2.1/testsuite/web-testsuite/test-2.5-servlets/target/selenium/user-extensions.js
[INFO] Downloading: http://download.java.net/maven/1//woodstox/poms/wstx-asl-3.2.1.pom
[INFO] Downloading: http://people.apache.org/repo/m2-incubating-repository//woodstox/wstx-asl/3.2.1/wstx-asl-3.2.1.pom
[INFO] Downloading: http://repo1.maven.org/maven2/woodstox/wstx-asl/3.2.1/wstx-asl-3.2.1.pom
[INFO] Downloading: http://download.java.net/maven/1//woodstox/poms/wstx-asl-3.2.1.pom
[INFO] Downloading: http://people.apache.org/repo/m2-incubating-repository//woodstox/wstx-asl/3.2.1/wstx-asl-3.2.1.pom
[INFO] Downloading: http://repo1.maven.org/maven2/woodstox/wstx-asl/3.2.1/wstx-asl-3.2.1.pom
[INFO] [INFO] [geronimo:deploy-module {execution: deploy-wars}]
[INFO] [INFO] Using non-artifact based module archive: /home/geronimo/geronimo/2.1/testsuite/web-testsuite/test-2.5-servlets/target/test-2.5-servlets-2.1.1-SNAPSHOT.war
[INFO] [INFO] Using non-artifact based plan: null
[INFO] [INFO] Distributing module artifact: /home/geronimo/geronimo/2.1/testsuite/web-testsuite/test-2.5-servlets/target/test-2.5-servlets-2.1.1-SNAPSHOT.war
with plan null
[WARNING] log4j:WARN No appenders could be found for logger (org.apache.geronimo.deployment.plugin.factories.BaseDeploymentFactory).
[WARNING] log4j:WARN Please initialize the log4j system properly.
[INFO] [WARNING] Ignoring failure !
[INFO] [INFO] [surefire:test {execution: integration}]
[INFO] [INFO] Surefire report directory: /home/geronimo/geronimo/2.1/testsuite/web-testsuite/test-2.5-servlets/target/surefire-reports
[INFO] 
[INFO] -------------------------------------------------------
[INFO]  T E S T S
[INFO] -------------------------------------------------------
[INFO] Running web-testsuite.servlets
[INFO] Tests run: 2, Failures: 2, Errors: 0, Skipped: 0, Time elapsed: 0.536 sec <<<
FAILURE!
[INFO] 
[INFO] Results :
[INFO] 
[INFO] Failed tests: 
[INFO]   testIndexContent2(org.apache.geronimo.testsuite.servlets.TestServlets)
[INFO]   testIndexContent(org.apache.geronimo.testsuite.servlets.TestServlets)
[INFO] 
[INFO] Tests run: 2, Failures: 2, Errors: 0, Skipped: 0
[INFO] 
[INFO] [ERROR] There are test failures.
[INFO] [INFO] [geronimo:undeploy-module {execution: undeploy-war-as-moduleId}]
[INFO] [INFO] Using non-artifact based module id: org.apache.geronimo.testsuite/test-2.5-servlets/2.1.1-SNAPSHOT/car
[INFO] [WARNING] Ignoring failure !
[INFO] [INFO] [tools:verify-legal-files {execution: verify-legal-files}]
[INFO] [INFO] Checking legal files in: test-2.5-servlets-2.1.1-SNAPSHOT.war
[INFO] [INFO] [install:install]
[INFO] [INFO] Installing /home/geronimo/geronimo/2.1/testsuite/web-testsuite/test-2.5-servlets/target/test-2.5-servlets-2.1.1-SNAPSHOT.war
to /home/geronimo/.m2/repository/org/apache/geronimo/testsuite/test-2.5-servlets/2.1.1-SNAPSHOT/test-2.5-servlets-2.1.1-SNAPSHOT.war
[INFO] [INFO] [testsuite:generate-surefire-xml {execution: generate-surefire-xml}]
[INFO] [INFO] Updating directory: /home/geronimo/geronimo/2.1/testsuite/web-testsuite/target/surefire-reports
[INFO] [INFO] Loading surefire xml for xmlproperty: /home/geronimo/geronimo/2.1/testsuite/web-testsuite/test-2.5-servlets/target/surefire-reports/TEST-org.apache.geronimo.mavenplugins.geronimo.module.DeployModuleMojo.xml
[INFO] [INFO] Loading surefire xml for xmlproperty: /home/geronimo/geronimo/2.1/testsuite/web-testsuite/test-2.5-servlets/target/surefire-reports/TEST-org.apache.geronimo.mavenplugins.geronimo.module.UndeployModuleMojo.xml
[INFO] [INFO] Loading parent surefire xml for xmlproperty: /home/geronimo/geronimo/2.1/testsuite/web-testsuite/target/surefire-reports/TEST-test-2.5-servlets.xml
[INFO] [INFO] Loading surefire xml for xmlproperty: /home/geronimo/geronimo/2.1/testsuite/web-testsuite/test-2.5-servlets/target/surefire-reports/TEST-web-testsuite.servlets.xml
[INFO] [INFO] Loading parent surefire xml for xmlproperty: /home/geronimo/geronimo/2.1/testsuite/web-testsuite/target/surefire-reports/TEST-test-2.5-servlets.xml
[INFO] [INFO] ------------------------------------------------------------------------
[INFO] [INFO] BUILD SUCCESSFUL
[INFO] [INFO] ------------------------------------------------------------------------
[INFO] [INFO] Total time: 20 seconds
[INFO] [INFO] Finished at: Wed Feb 27 15:07:48 EST 2008
[INFO] [INFO] Final Memory: 26M/554M
[INFO] [INFO] ------------------------------------------------------------------------
[INFO] [tools:verify-legal-files {execution: verify-legal-files}]
[INFO] [install:install]
[INFO] Installing /home/geronimo/geronimo/2.1/testsuite/web-testsuite/pom.xml to /home/geronimo/.m2/repository/org/apache/geronimo/testsuite/web-testsuite/2.1.1-SNAPSHOT/web-testsuite-2.1.1-SNAPSHOT.pom
[INFO] [testsuite:generate-surefire-xml {execution: generate-surefire-xml}]
[INFO] Updating directory: /home/geronimo/geronimo/2.1/testsuite/target/surefire-reports
[INFO] Loading surefire xml for xmlproperty: /home/geronimo/geronimo/2.1/testsuite/web-testsuite/target/surefire-reports/TEST-test-myfaces.xml
[INFO] Loading surefire xml for xmlproperty: /home/geronimo/geronimo/2.1/testsuite/web-testsuite/target/surefire-reports/TEST-test-tomcat.xml
[INFO] Loading parent surefire xml for xmlproperty: /home/geronimo/geronimo/2.1/testsuite/target/surefire-reports/TEST-web-testsuite.xml
[INFO] Loading surefire xml for xmlproperty: /home/geronimo/geronimo/2.1/testsuite/web-testsuite/target/surefire-reports/TEST-test-2.5-servlets.xml
[INFO] Loading parent surefire xml for xmlproperty: /home/geronimo/geronimo/2.1/testsuite/target/surefire-reports/TEST-web-testsuite.xml
[INFO] Loading surefire xml for xmlproperty: /home/geronimo/geronimo/2.1/testsuite/web-testsuite/target/surefire-reports/TEST-test-2.1-jsps.xml
[INFO] Loading parent surefire xml for xmlproperty: /home/geronimo/geronimo/2.1/testsuite/target/surefire-reports/TEST-web-testsuite.xml
[INFO] Loading surefire xml for xmlproperty: /home/geronimo/geronimo/2.1/testsuite/web-testsuite/target/surefire-reports/TEST-org.apache.geronimo.mavenplugins.geronimo.server.StartServerMojo.xml
[INFO] Loading parent surefire xml for xmlproperty: /home/geronimo/geronimo/2.1/testsuite/target/surefire-reports/TEST-web-testsuite.xml
[INFO] [geronimo:stop-server {execution: stop-server}]
[INFO] ------------------------------------------------------------------------
[ERROR] BUILD ERROR
 
Assembly: jetty
=================================
See the full test.log file at http://geronimo.apache.org/maven/server/binaries/2.1/20080227/logs-1400-jetty/test.log
 
[INFO] Running console-testsuite.basic-console
[INFO] Tests run: 42, Failures: 1, Errors: 0, Skipped: 5, Time elapsed: 95.046 sec <<<
FAILURE!
[INFO] Running console-testsuite.advance-test
[INFO] Tests run: 13, Failures: 13, Errors: 0, Skipped: 0, Time elapsed: 5.347 sec <<<
FAILURE!
 
[INFO] [INFO] Installing /home/geronimo/geronimo/2.1/testsuite/console-testsuite/basic/target/basic-2.1.1-SNAPSHOT.jar
to /home/geronimo/.m2/repository/org/apache/geronimo/testsuite/basic/2.1.1-SNAPSHOT/basic-2.1.1-SNAPSHOT.jar
[INFO] [INFO] [testsuite:generate-surefire-xml {execution: generate-surefire-xml}]
[INFO] [INFO] Updating directory: /home/geronimo/geronimo/2.1/testsuite/console-testsuite/target/surefire-reports
[INFO] [INFO] Loading surefire xml for xmlproperty: /home/geronimo/geronimo/2.1/testsuite/console-testsuite/basic/target/surefire-reports/TEST-console-testsuite.basic-console.xml
[INFO] [INFO] ------------------------------------------------------------------------
[INFO] [INFO] BUILD SUCCESSFUL
[INFO] [INFO] ------------------------------------------------------------------------
[INFO] [INFO] Total time: 1 minute 52 seconds
[INFO] [INFO] Finished at: Wed Feb 27 15:28:08 EST 2008
[INFO] [INFO] Final Memory: 19M/554M
[INFO] [INFO] ------------------------------------------------------------------------
[INFO] Invoking: /home/geronimo/geronimo/2.1/testsuite/console-testsuite/advanced/pom.xml
[INFO] + Error stacktraces are turned on.
[INFO] [INFO] Scanning for projects...
[INFO] [INFO] ----------------------------------------------------------------------------
[INFO] [INFO] Building Geronimo TestSuite :: Console Testsuite :: Advanced Tests
[INFO] [INFO]    task-segment: [install]
[INFO] [INFO] ----------------------------------------------------------------------------
[INFO] [INFO] [enforcer:enforce {execution: default}]
[INFO] [INFO] [tools:copy-legal-files {execution: install-legal-files}]
[INFO] [INFO] Created dir: /home/geronimo/geronimo/2.1/testsuite/console-testsuite/advanced/target/classes/META-INF
[INFO] [INFO] Copying 2 files to /home/geronimo/geronimo/2.1/testsuite/console-testsuite/advanced/target/classes/META-INF
[INFO] [INFO] [resources:resources]
[INFO] [INFO] Using default encoding to copy filtered resources.
[INFO] [INFO] [compiler:compile]
[INFO] [INFO] No sources to compile
[INFO] [INFO] [resources:testResources]
[INFO] [INFO] Using default encoding to copy filtered resources.
[INFO] [INFO] [compiler:testCompile]
[INFO] [INFO] Compiling 8 source files to /home/geronimo/geronimo/2.1/testsuite/console-testsuite/advanced/target/test-classes
[INFO] [INFO] [surefire:test]
[INFO] [INFO] Tests are skipped.
[INFO] [INFO] [surefire:test {execution: test}]
[INFO] [INFO] Tests are skipped.
[INFO] [INFO] [jar:jar]
[INFO] [INFO] Building jar: /home/geronimo/geronimo/2.1/testsuite/console-testsuite/advanced/target/advanced-2.1.1-SNAPSHOT.jar
[INFO] [INFO] [selenium:start-server {execution: start-server}]
[INFO] [INFO] Starting Selenium server...
[INFO] [INFO] Created dir: /home/geronimo/geronimo/2.1/testsuite/console-testsuite/advanced/target/selenium
[INFO] Launching Selenium Server
[INFO] Waiting for Selenium Server...
[INFO] Selenium Server started
[INFO] [INFO] [surefire:test {execution: integration}]
[INFO] [INFO] Surefire report directory: /home/geronimo/geronimo/2.1/testsuite/console-testsuite/advanced/target/surefire-reports
[INFO] [WARNING] OS appears to be Unix and no DISPLAY environment variable has been detected.
Browser maybe unable to function correctly. Consider using the selenium:xvfb goal to enable
headless operation.
[INFO] [INFO] Redirecting output to: /home/geronimo/geronimo/2.1/testsuite/console-testsuite/advanced/target/selenium/server.log
[INFO] [INFO] User extensions: /home/geronimo/geronimo/2.1/testsuite/console-testsuite/advanced/target/selenium/user-extensions.js
[INFO] 
[INFO] -------------------------------------------------------
[INFO]  T E S T S
[INFO] -------------------------------------------------------
[INFO] Running console-testsuite.advance-test
[INFO] Tests run: 13, Failures: 13, Errors: 0, Skipped: 0, Time elapsed: 5.347 sec <<<
FAILURE!
[INFO] 
[INFO] Results :
[INFO] 
[INFO] Failed tests: 
[INFO]   testNewGroup(org.apache.geronimo.testsuite.console.ConsoleRealmTest)
[INFO]   testNewUser(org.apache.geronimo.testsuite.console.ConsoleRealmTest)
[INFO]   testNewDB(org.apache.geronimo.testsuite.console.DBManagerTest)
[INFO]   testNewDBPool(org.apache.geronimo.testsuite.console.DatabasePoolTest)
[INFO]   testEmptyDeployment(org.apache.geronimo.testsuite.console.DeploymentTest)
[INFO]   testNewJMSResource(org.apache.geronimo.testsuite.console.JMSResourcesTest)
[INFO]   testEditNetworkListener(org.apache.geronimo.testsuite.console.JMSServerTest)
[INFO]   testNewListener(org.apache.geronimo.testsuite.console.JMSServerTest)
[INFO]   testStartStopListener(org.apache.geronimo.testsuite.console.JMSServerTest)
[INFO]   testListPlugins(org.apache.geronimo.testsuite.console.PluginsTest)
[INFO]   testStartStopConnector(org.apache.geronimo.testsuite.console.WebServerTest)
[INFO]   testNewConnector(org.apache.geronimo.testsuite.console.WebServerTest)
[INFO]   testEditConnector(org.apache.geronimo.testsuite.console.WebServerTest)
[INFO] 
[INFO] Tests run: 13, Failures: 13, Errors: 0, Skipped: 0
[INFO] 
[INFO] [ERROR] There are test failures.
[INFO] [INFO] [tools:verify-legal-files {execution: verify-legal-files}]
[INFO] [INFO] Checking legal files in: advanced-2.1.1-SNAPSHOT.jar
[INFO] [INFO] [install:install]
[INFO] [INFO] Installing /home/geronimo/geronimo/2.1/testsuite/console-testsuite/advanced/target/advanced-2.1.1-SNAPSHOT.jar
to /home/geronimo/.m2/repository/org/apache/geronimo/testsuite/advanced/2.1.1-SNAPSHOT/advanced-2.1.1-SNAPSHOT.jar
[INFO] [INFO] [testsuite:generate-surefire-xml {execution: generate-surefire-xml}]
[INFO] [INFO] Updating directory: /home/geronimo/geronimo/2.1/testsuite/console-testsuite/target/surefire-reports
[INFO] [INFO] Loading surefire xml for xmlproperty: /home/geronimo/geronimo/2.1/testsuite/console-testsuite/advanced/target/surefire-reports/TEST-console-testsuite.advance-test.xml
[INFO] [INFO] ------------------------------------------------------------------------
[INFO] [INFO] BUILD SUCCESSFUL
[INFO] [INFO] ------------------------------------------------------------------------
[INFO] [INFO] Total time: 25 seconds
[INFO] [INFO] Finished at: Wed Feb 27 15:28:35 EST 2008
[INFO] [INFO] Final Memory: 19M/555M
[INFO] [INFO] ------------------------------------------------------------------------
[INFO] [tools:verify-legal-files {execution: verify-legal-files}]
[INFO] [install:install]
[INFO] Installing /home/geronimo/geronimo/2.1/testsuite/console-testsuite/pom.xml to /home/geronimo/.m2/repository/org/apache/geronimo/testsuite/console-testsuite/2.1.1-SNAPSHOT/console-testsuite-2.1.1-SNAPSHOT.pom
[INFO] [testsuite:generate-surefire-xml {execution: generate-surefire-xml}]
[INFO] Updating directory: /home/geronimo/geronimo/2.1/testsuite/target/surefire-reports
[INFO] Loading surefire xml for xmlproperty: /home/geronimo/geronimo/2.1/testsuite/console-testsuite/target/surefire-reports/TEST-basic.xml
[INFO] Loading surefire xml for xmlproperty: /home/geronimo/geronimo/2.1/testsuite/console-testsuite/target/surefire-reports/TEST-advanced.xml
[INFO] Loading parent surefire xml for xmlproperty: /home/geronimo/geronimo/2.1/testsuite/target/surefire-reports/TEST-console-testsuite.xml
[INFO] Loading surefire xml for xmlproperty: /home/geronimo/geronimo/2.1/testsuite/console-testsuite/target/surefire-reports/TEST-org.apache.geronimo.mavenplugins.geronimo.server.StartServerMojo.xml
[INFO] Loading parent surefire xml for xmlproperty: /home/geronimo/geronimo/2.1/testsuite/target/surefire-reports/TEST-console-testsuite.xml
[INFO] [geronimo:stop-server {execution: stop-server}]
[INFO] ------------------------------------------------------------------------
[ERROR] BUILD ERROR

Mime
View raw message