geronimo-dev mailing list archives

Site index · List index
Message view « Date » · « Thread »
Top « Date » · « Thread »
From ga...@apache.org
Subject [BUILD] 2.2: Failed for Revision: 630438
Date Sat, 23 Feb 2008 14:30:45 GMT
Geronimo Revision: 630438 built with tests included
 
See the full build-0900.log file at http://geronimo.apache.org/maven/server/binaries/trunk/20080223/build-0900.log
 
 
See the unit test reports at http://geronimo.apache.org/maven/server/binaries/trunk/20080223/unit-test-reports
 
[INFO] [compiler:compile]
[INFO] Compiling 6 source files to /home/geronimo/geronimo/trunk/plugins/webservices/geronimo-webservices-builder/target/classes
[INFO] [resources:testResources]
[INFO] Using default encoding to copy filtered resources.
[INFO] [compiler:testCompile]
[INFO] Compiling 1 source file to /home/geronimo/geronimo/trunk/plugins/webservices/geronimo-webservices-builder/target/test-classes
[INFO] [surefire:test]
[INFO] Surefire report directory: /home/geronimo/geronimo/trunk/plugins/webservices/geronimo-webservices-builder/target/surefire-reports

-------------------------------------------------------
 T E S T S
-------------------------------------------------------
Running org.apache.geronimo.webservices.builder.ParsingTest
Tests run: 7, Failures: 0, Errors: 0, Skipped: 0, Time elapsed: 1.467 sec

Results :

Tests run: 7, Failures: 0, Errors: 0, Skipped: 0

[INFO] [jar:jar]
[INFO] Building jar: /home/geronimo/geronimo/trunk/plugins/webservices/geronimo-webservices-builder/target/geronimo-webservices-builder-2.2-SNAPSHOT.jar
[INFO] [tools:verify-legal-files {execution: verify-legal-files}]
[INFO] Checking legal files in: geronimo-webservices-builder-2.2-SNAPSHOT.jar
[INFO] [install:install]
[INFO] Installing /home/geronimo/geronimo/trunk/plugins/webservices/geronimo-webservices-builder/target/geronimo-webservices-builder-2.2-SNAPSHOT.jar
to /home/geronimo/.m2/repository/org/apache/geronimo/modules/geronimo-webservices-builder/2.2-SNAPSHOT/geronimo-webservices-builder-2.2-SNAPSHOT.jar
[INFO] ----------------------------------------------------------------------------
[INFO] Building Geronimo Plugins, OpenEJB :: Builder
[INFO]    task-segment: [install]
[INFO] ----------------------------------------------------------------------------
[INFO] [enforcer:enforce {execution: default}]
[INFO] [xmlbeans:xmlbeans {execution: default}]
Time to build schema type system: 0.095 seconds
Time to generate code: 0.06 seconds
Time to compile code: 2.492 seconds
[INFO] [tools:copy-legal-files {execution: install-legal-files}]
[INFO] Created dir: /home/geronimo/geronimo/trunk/plugins/openejb/geronimo-openejb-builder/target/classes/META-INF
[INFO] Copying 2 files to /home/geronimo/geronimo/trunk/plugins/openejb/geronimo-openejb-builder/target/classes/META-INF
[INFO] [buildsupport:copy-xmlbeans-schemas {execution: default}]
[INFO] Created dir: /home/geronimo/geronimo/trunk/plugins/openejb/geronimo-openejb-builder/target/clover/classes
[INFO] Copying 32 files to /home/geronimo/geronimo/trunk/plugins/openejb/geronimo-openejb-builder/target/clover/classes
[INFO] [resources:resources]
[INFO] Using default encoding to copy filtered resources.
[INFO] [compiler:compile]
[INFO] Compiling 9 source files to /home/geronimo/geronimo/trunk/plugins/openejb/geronimo-openejb-builder/target/classes
[INFO] ------------------------------------------------------------------------
[ERROR] BUILD FAILURE
[INFO] ------------------------------------------------------------------------
[INFO] Compilation failure
/home/geronimo/geronimo/trunk/plugins/openejb/geronimo-openejb-builder/src/main/java/org/apache/geronimo/openejb/deployment/EjbModuleBuilder.java:[632,52]
cannot find symbol
symbol  : constructor ConfigurationFactory(boolean,org.apache.openejb.config.ConfigurationFactory.Chain,org.apache.openejb.assembler.classic.OpenEjbConfiguration)
location: class org.apache.openejb.config.ConfigurationFactory



/home/geronimo/geronimo/trunk/plugins/openejb/geronimo-openejb-builder/src/main/java/org/apache/geronimo/openejb/deployment/EjbModuleBuilder.java:[632,52]
cannot find symbol
symbol  : constructor ConfigurationFactory(boolean,org.apache.openejb.config.ConfigurationFactory.Chain,org.apache.openejb.assembler.classic.OpenEjbConfiguration)
location: class org.apache.openejb.config.ConfigurationFactory


[INFO] ------------------------------------------------------------------------
[INFO] Trace
org.apache.maven.BuildFailureException: Compilation failure
/home/geronimo/geronimo/trunk/plugins/openejb/geronimo-openejb-builder/src/main/java/org/apache/geronimo/openejb/deployment/EjbModuleBuilder.java:[632,52]
cannot find symbol
symbol  : constructor ConfigurationFactory(boolean,org.apache.openejb.config.ConfigurationFactory.Chain,org.apache.openejb.assembler.classic.OpenEjbConfiguration)
location: class org.apache.openejb.config.ConfigurationFactory


	at org.apache.maven.lifecycle.DefaultLifecycleExecutor.executeGoals(DefaultLifecycleExecutor.java:560)
	at org.apache.maven.lifecycle.DefaultLifecycleExecutor.executeGoalWithLifecycle(DefaultLifecycleExecutor.java:480)
	at org.apache.maven.lifecycle.DefaultLifecycleExecutor.executeGoal(DefaultLifecycleExecutor.java:459)
	at org.apache.maven.lifecycle.DefaultLifecycleExecutor.executeGoalAndHandleFailures(DefaultLifecycleExecutor.java:311)
	at org.apache.maven.lifecycle.DefaultLifecycleExecutor.executeTaskSegments(DefaultLifecycleExecutor.java:278)
	at org.apache.maven.lifecycle.DefaultLifecycleExecutor.execute(DefaultLifecycleExecutor.java:143)
	at org.apache.maven.DefaultMaven.doExecute(DefaultMaven.java:334)
	at org.apache.maven.DefaultMaven.execute(DefaultMaven.java:125)
	at org.apache.maven.cli.MavenCli.main(MavenCli.java:280)
	at sun.reflect.NativeMethodAccessorImpl.invoke0(Native Method)
	at sun.reflect.NativeMethodAccessorImpl.invoke(NativeMethodAccessorImpl.java:39)
	at sun.reflect.DelegatingMethodAccessorImpl.invoke(DelegatingMethodAccessorImpl.java:25)
	at java.lang.reflect.Method.invoke(Method.java:585)
	at org.codehaus.classworlds.Launcher.launchEnhanced(Launcher.java:315)
	at org.codehaus.classworlds.Launcher.launch(Launcher.java:255)
	at org.codehaus.classworlds.Launcher.mainWithExitCode(Launcher.java:430)
	at org.codehaus.classworlds.Launcher.main(Launcher.java:375)
Caused by: org.apache.maven.plugin.CompilationFailureException: Compilation failure
/home/geronimo/geronimo/trunk/plugins/openejb/geronimo-openejb-builder/src/main/java/org/apache/geronimo/openejb/deployment/EjbModuleBuilder.java:[632,52]
cannot find symbol
symbol  : constructor ConfigurationFactory(boolean,org.apache.openejb.config.ConfigurationFactory.Chain,org.apache.openejb.assembler.classic.OpenEjbConfiguration)
location: class org.apache.openejb.config.ConfigurationFactory


	at org.apache.maven.plugin.AbstractCompilerMojo.execute(AbstractCompilerMojo.java:516)
	at org.apache.maven.plugin.CompilerMojo.execute(CompilerMojo.java:114)
	at org.apache.maven.plugin.DefaultPluginManager.executeMojo(DefaultPluginManager.java:443)
	at org.apache.maven.lifecycle.DefaultLifecycleExecutor.executeGoals(DefaultLifecycleExecutor.java:539)
	... 16 more
[INFO] ------------------------------------------------------------------------
[INFO] Total time: 18 minutes 30 seconds
[INFO] Finished at: Sat Feb 23 09:23:24 EST 2008
[INFO] Final Memory: 259M/558M
[INFO] ------------------------------------------------------------------------

Mime
View raw message