geronimo-dev mailing list archives

Site index · List index
Message view « Date » · « Thread »
Top « Date » · « Thread »
From ga...@apache.org
Subject [BUILD] 2.2: Failed for Revision: 620808
Date Tue, 12 Feb 2008 14:56:45 GMT
Geronimo Revision: 620808 built with tests included
 
See the full build-0900.log file at http://geronimo.apache.org/maven/server/binaries/trunk/20080212/build-0900.log
 
 
See the unit test reports at http://geronimo.apache.org/maven/server/binaries/trunk/20080212/unit-test-reports
 
[INFO] [tools:verify-legal-files {execution: verify-legal-files}]
[INFO] Checking legal files in: geronimo-naming-builder-2.2-SNAPSHOT.jar
[INFO] [install:install]
[INFO] Installing /home/geronimo/geronimo/trunk/plugins/j2ee/geronimo-naming-builder/target/geronimo-naming-builder-2.2-SNAPSHOT.jar
to /home/geronimo/.m2/repository/org/apache/geronimo/modules/geronimo-naming-builder/2.2-SNAPSHOT/geronimo-naming-builder-2.2-SNAPSHOT.jar
[INFO] ----------------------------------------------------------------------------
[INFO] Building Geronimo Plugins, Connector :: Builder
[INFO]    task-segment: [install]
[INFO] ----------------------------------------------------------------------------
[INFO] [enforcer:enforce {execution: default}]
[INFO] [xmlbeans:xmlbeans {execution: default}]
Time to build schema type system: 0.195 seconds
Time to generate code: 0.196 seconds
Time to compile code: 3.363 seconds
[INFO] [tools:copy-legal-files {execution: install-legal-files}]
[INFO] Created dir: /home/geronimo/geronimo/trunk/plugins/connector/geronimo-connector-builder/target/classes/META-INF
[INFO] Copying 2 files to /home/geronimo/geronimo/trunk/plugins/connector/geronimo-connector-builder/target/classes/META-INF
[INFO] [buildsupport:copy-xmlbeans-schemas {execution: default}]
[INFO] Created dir: /home/geronimo/geronimo/trunk/plugins/connector/geronimo-connector-builder/target/clover/classes
[INFO] Copying 62 files to /home/geronimo/geronimo/trunk/plugins/connector/geronimo-connector-builder/target/clover/classes
[INFO] [resources:resources]
[INFO] Using default encoding to copy filtered resources.
[INFO] [compiler:compile]
[INFO] Compiling 31 source files to /home/geronimo/geronimo/trunk/plugins/connector/geronimo-connector-builder/target/classes
[INFO] [resources:testResources]
[INFO] Using default encoding to copy filtered resources.
[INFO] [antrun:run {execution: default}]
[INFO] Executing tasks

default:
    [mkdir] Created dir: /home/geronimo/geronimo/trunk/plugins/connector/geronimo-connector-builder/target/test-rar-10/META-INF
     [copy] Copying 2 files to /home/geronimo/geronimo/trunk/plugins/connector/geronimo-connector-builder/target/test-rar-10/META-INF
      [jar] Building jar: /home/geronimo/geronimo/trunk/plugins/connector/geronimo-connector-builder/target/test-rar-10.rar
    [mkdir] Created dir: /home/geronimo/geronimo/trunk/plugins/connector/geronimo-connector-builder/target/test-rar-15/META-INF
     [copy] Copying 2 files to /home/geronimo/geronimo/trunk/plugins/connector/geronimo-connector-builder/target/test-rar-15/META-INF
      [jar] Building jar: /home/geronimo/geronimo/trunk/plugins/connector/geronimo-connector-builder/target/test-rar-15.rar
    [mkdir] Created dir: /home/geronimo/geronimo/trunk/plugins/connector/geronimo-connector-builder/target/test-rar-15-notx/META-INF
     [copy] Copying 2 files to /home/geronimo/geronimo/trunk/plugins/connector/geronimo-connector-builder/target/test-rar-15-notx/META-INF
      [jar] Building jar: /home/geronimo/geronimo/trunk/plugins/connector/geronimo-connector-builder/target/test-rar-15-notx.rar
    [mkdir] Created dir: /home/geronimo/geronimo/trunk/plugins/connector/geronimo-connector-builder/target/test-rar-15-localtx/META-INF
     [copy] Copying 2 files to /home/geronimo/geronimo/trunk/plugins/connector/geronimo-connector-builder/target/test-rar-15-localtx/META-INF
      [jar] Building jar: /home/geronimo/geronimo/trunk/plugins/connector/geronimo-connector-builder/target/test-rar-15-localtx.rar
      [jar] Building jar: /home/geronimo/geronimo/trunk/plugins/connector/geronimo-connector-builder/target/test-ear.ear
    [mkdir] Created dir: /home/geronimo/geronimo/trunk/plugins/connector/geronimo-connector-builder/target/test-rar-10-noger/META-INF
     [copy] Copying 1 file to /home/geronimo/geronimo/trunk/plugins/connector/geronimo-connector-builder/target/test-rar-10-noger/META-INF
      [jar] Building jar: /home/geronimo/geronimo/trunk/plugins/connector/geronimo-connector-builder/target/test-rar-10-noger.rar
    [mkdir] Created dir: /home/geronimo/geronimo/trunk/plugins/connector/geronimo-connector-builder/target/test-rar-15-noger/META-INF
     [copy] Copying 1 file to /home/geronimo/geronimo/trunk/plugins/connector/geronimo-connector-builder/target/test-rar-15-noger/META-INF
      [jar] Building jar: /home/geronimo/geronimo/trunk/plugins/connector/geronimo-connector-builder/target/test-rar-15-noger.rar
      [jar] Building jar: /home/geronimo/geronimo/trunk/plugins/connector/geronimo-connector-builder/target/test-ear-noger.ear
[INFO] Executed tasks
[INFO] [compiler:testCompile]
[INFO] Compiling 23 source files to /home/geronimo/geronimo/trunk/plugins/connector/geronimo-connector-builder/target/test-classes
[INFO] ------------------------------------------------------------------------
[ERROR] BUILD FAILURE
[INFO] ------------------------------------------------------------------------
[INFO] Compilation failure
/home/geronimo/geronimo/trunk/plugins/connector/geronimo-connector-builder/src/test/java/org/apache/geronimo/connector/deployment/MessageDestinationTest.java:[189,18]
org.apache.geronimo.connector.deployment.MessageDestinationTest.MockConfigurationManager is
not abstract and does not override abstract method sort(java.util.List<org.apache.geronimo.kernel.repository.Artifact>,org.apache.geronimo.kernel.config.LifecycleMonitor)
in org.apache.geronimo.kernel.config.ConfigurationManager



/home/geronimo/geronimo/trunk/plugins/connector/geronimo-connector-builder/src/test/java/org/apache/geronimo/connector/deployment/MessageDestinationTest.java:[189,18]
org.apache.geronimo.connector.deployment.MessageDestinationTest.MockConfigurationManager is
not abstract and does not override abstract method sort(java.util.List<org.apache.geronimo.kernel.repository.Artifact>,org.apache.geronimo.kernel.config.LifecycleMonitor)
in org.apache.geronimo.kernel.config.ConfigurationManager


[INFO] ------------------------------------------------------------------------
[INFO] Trace
org.apache.maven.BuildFailureException: Compilation failure
/home/geronimo/geronimo/trunk/plugins/connector/geronimo-connector-builder/src/test/java/org/apache/geronimo/connector/deployment/MessageDestinationTest.java:[189,18]
org.apache.geronimo.connector.deployment.MessageDestinationTest.MockConfigurationManager is
not abstract and does not override abstract method sort(java.util.List<org.apache.geronimo.kernel.repository.Artifact>,org.apache.geronimo.kernel.config.LifecycleMonitor)
in org.apache.geronimo.kernel.config.ConfigurationManager


	at org.apache.maven.lifecycle.DefaultLifecycleExecutor.executeGoals(DefaultLifecycleExecutor.java:560)
	at org.apache.maven.lifecycle.DefaultLifecycleExecutor.executeGoalWithLifecycle(DefaultLifecycleExecutor.java:480)
	at org.apache.maven.lifecycle.DefaultLifecycleExecutor.executeGoal(DefaultLifecycleExecutor.java:459)
	at org.apache.maven.lifecycle.DefaultLifecycleExecutor.executeGoalAndHandleFailures(DefaultLifecycleExecutor.java:311)
	at org.apache.maven.lifecycle.DefaultLifecycleExecutor.executeTaskSegments(DefaultLifecycleExecutor.java:278)
	at org.apache.maven.lifecycle.DefaultLifecycleExecutor.execute(DefaultLifecycleExecutor.java:143)
	at org.apache.maven.DefaultMaven.doExecute(DefaultMaven.java:334)
	at org.apache.maven.DefaultMaven.execute(DefaultMaven.java:125)
	at org.apache.maven.cli.MavenCli.main(MavenCli.java:280)
	at sun.reflect.NativeMethodAccessorImpl.invoke0(Native Method)
	at sun.reflect.NativeMethodAccessorImpl.invoke(NativeMethodAccessorImpl.java:39)
	at sun.reflect.DelegatingMethodAccessorImpl.invoke(DelegatingMethodAccessorImpl.java:25)
	at java.lang.reflect.Method.invoke(Method.java:585)
	at org.codehaus.classworlds.Launcher.launchEnhanced(Launcher.java:315)
	at org.codehaus.classworlds.Launcher.launch(Launcher.java:255)
	at org.codehaus.classworlds.Launcher.mainWithExitCode(Launcher.java:430)
	at org.codehaus.classworlds.Launcher.main(Launcher.java:375)
Caused by: org.apache.maven.plugin.CompilationFailureException: Compilation failure
/home/geronimo/geronimo/trunk/plugins/connector/geronimo-connector-builder/src/test/java/org/apache/geronimo/connector/deployment/MessageDestinationTest.java:[189,18]
org.apache.geronimo.connector.deployment.MessageDestinationTest.MockConfigurationManager is
not abstract and does not override abstract method sort(java.util.List<org.apache.geronimo.kernel.repository.Artifact>,org.apache.geronimo.kernel.config.LifecycleMonitor)
in org.apache.geronimo.kernel.config.ConfigurationManager


	at org.apache.maven.plugin.AbstractCompilerMojo.execute(AbstractCompilerMojo.java:516)
	at org.apache.maven.plugin.TestCompilerMojo.execute(TestCompilerMojo.java:102)
	at org.apache.maven.plugin.DefaultPluginManager.executeMojo(DefaultPluginManager.java:443)
	at org.apache.maven.lifecycle.DefaultLifecycleExecutor.executeGoals(DefaultLifecycleExecutor.java:539)
	... 16 more
[INFO] ------------------------------------------------------------------------
[INFO] Total time: 10 minutes 
[INFO] Finished at: Tue Feb 12 09:50:41 EST 2008
[INFO] Final Memory: 189M/540M
[INFO] ------------------------------------------------------------------------

Mime
View raw message