geronimo-dev mailing list archives

Site index · List index
Message view « Date » · « Thread »
Top « Date » · « Thread »
From ga...@apache.org
Subject [BUILD] 2.1: Failed for Revision: 619386
Date Thu, 07 Feb 2008 14:55:14 GMT
Geronimo Revision: 619386 built with tests included
 
See the full build-0800.log file at http://geronimo.apache.org/maven/server/binaries/2.1/20080207/build-0800.log
 
Download the binaries from http://geronimo.apache.org/maven/server/binaries/2.1/20080207
[INFO] BUILD SUCCESSFUL
[INFO] ------------------------------------------------------------------------
[INFO] Total time: 34 minutes 27 seconds
[INFO] Finished at: Thu Feb 07 08:47:20 EST 2008
[INFO] Final Memory: 285M/1012M
[INFO] ------------------------------------------------------------------------
 
TESTSUITE RESULTS (Failures only)
=================================
See detailed results at http://geronimo.apache.org/maven/server/testsuite/ResultsSummary.html
 
Assembly: tomcat
=================================
See the full test.log file at http://geronimo.apache.org/maven/server/binaries/2.1/20080207/logs-0800-tomcat/test.log
 
 
[INFO] [INFO] Loading surefire xml for xmlproperty: /home/geronimo/geronimo/2.1/testsuite/webservices-testsuite/jaxws-tests/jaxws-client/target/surefire-reports/TEST-org.apache.geronimo.mavenplugins.geronimo.module.UndeployModuleMojo.xml
[INFO] [INFO] Loading parent surefire xml for xmlproperty: /home/geronimo/geronimo/2.1/testsuite/webservices-testsuite/target/surefire-reports/TEST-jaxws-client.xml
[INFO] [INFO] Loading surefire xml for xmlproperty: /home/geronimo/geronimo/2.1/testsuite/webservices-testsuite/jaxws-tests/jaxws-client/target/surefire-reports/TEST-org.apache.geronimo.mavenplugins.geronimo.server.RunClientMojo.xml
[INFO] [INFO] Loading parent surefire xml for xmlproperty: /home/geronimo/geronimo/2.1/testsuite/webservices-testsuite/target/surefire-reports/TEST-jaxws-client.xml
[INFO] [INFO] Loading surefire xml for xmlproperty: /home/geronimo/geronimo/2.1/testsuite/webservices-testsuite/jaxws-tests/jaxws-client/target/surefire-reports/TEST-org.apache.geronimo.testsuite.testset.ClientJAXWSTest.xml
[INFO] [INFO] Loading parent surefire xml for xmlproperty: /home/geronimo/geronimo/2.1/testsuite/webservices-testsuite/target/surefire-reports/TEST-jaxws-client.xml
[INFO] [INFO] ----------------------------------------------------------------------------
[INFO] [INFO] Building Geronimo TestSuite :: WebServices TestSuite :: JAX-WS EJB
[INFO] [INFO]    task-segment: [install]
[INFO] [INFO] ----------------------------------------------------------------------------
[INFO] [INFO] [enforcer:enforce {execution: default}]
[INFO] [INFO] [tools:copy-legal-files {execution: install-legal-files}]
[INFO] [INFO] Created dir: /home/geronimo/geronimo/2.1/testsuite/webservices-testsuite/jaxws-tests/jaxws-ejb/target/classes/META-INF
[INFO] [INFO] Copying 2 files to /home/geronimo/geronimo/2.1/testsuite/webservices-testsuite/jaxws-tests/jaxws-ejb/target/classes/META-INF
[INFO] [INFO] [resources:resources]
[INFO] [INFO] Using default encoding to copy filtered resources.
[INFO] [INFO] [compiler:compile]
[INFO] [INFO] Compiling 4 source files to /home/geronimo/geronimo/2.1/testsuite/webservices-testsuite/jaxws-tests/jaxws-ejb/target/classes
[INFO] [INFO] ------------------------------------------------------------------------
[INFO] [ERROR] BUILD FAILURE
[INFO] [INFO] ------------------------------------------------------------------------
[INFO] [INFO] Compilation failure
[INFO] 
[INFO] /home/geronimo/geronimo/2.1/testsuite/webservices-testsuite/jaxws-tests/jaxws-ejb/src/main/java/org/apache/geronimo/test/GreeterLogicalHandler.java:[25,24]
package javax.annotation does not exist
[INFO] 
[INFO] /home/geronimo/geronimo/2.1/testsuite/webservices-testsuite/jaxws-tests/jaxws-ejb/src/main/java/org/apache/geronimo/test/GreeterLogicalHandler.java:[26,24]
package javax.annotation does not exist
[INFO] 
[INFO] /home/geronimo/geronimo/2.1/testsuite/webservices-testsuite/jaxws-tests/jaxws-ejb/src/main/java/org/apache/geronimo/test/GreeterLogicalHandler.java:[27,24]
package javax.annotation does not exist
[INFO] 
[INFO] /home/geronimo/geronimo/2.1/testsuite/webservices-testsuite/jaxws-tests/jaxws-ejb/src/main/java/org/apache/geronimo/test/GreeterSOAPHandler.java:[26,24]
package javax.annotation does not exist
[INFO] 
[INFO] /home/geronimo/geronimo/2.1/testsuite/webservices-testsuite/jaxws-tests/jaxws-ejb/src/main/java/org/apache/geronimo/test/GreeterSOAPHandler.java:[27,24]
package javax.annotation does not exist
[INFO] 
[INFO] /home/geronimo/geronimo/2.1/testsuite/webservices-testsuite/jaxws-tests/jaxws-ejb/src/main/java/org/apache/geronimo/test/GreeterSOAPHandler.java:[28,24]
package javax.annotation does not exist
[INFO] 
[INFO] /home/geronimo/geronimo/2.1/testsuite/webservices-testsuite/jaxws-tests/jaxws-ejb/src/main/java/org/apache/geronimo/test/GreeterLogicalHandler.java:[39,5]
cannot find symbol
[INFO] symbol  : class Resource
[INFO] location: class org.apache.geronimo.test.GreeterLogicalHandler
[INFO] 
[INFO] /home/geronimo/geronimo/2.1/testsuite/webservices-testsuite/jaxws-tests/jaxws-ejb/src/main/java/org/apache/geronimo/test/GreeterLogicalHandler.java:[41,5]
cannot find symbol
[INFO] symbol  : class Resource
[INFO] location: class org.apache.geronimo.test.GreeterLogicalHandler
[INFO] 
[INFO] /home/geronimo/geronimo/2.1/testsuite/webservices-testsuite/jaxws-tests/jaxws-ejb/src/main/java/org/apache/geronimo/test/GreeterLogicalHandler.java:[50,5]
cannot find symbol
[INFO] symbol  : class PostConstruct
[INFO] location: class org.apache.geronimo.test.GreeterLogicalHandler
[INFO] 
[INFO] /home/geronimo/geronimo/2.1/testsuite/webservices-testsuite/jaxws-tests/jaxws-ejb/src/main/java/org/apache/geronimo/test/GreeterLogicalHandler.java:[55,5]
cannot find symbol
[INFO] symbol  : class PreDestroy
[INFO] location: class org.apache.geronimo.test.GreeterLogicalHandler
[INFO] 
[INFO] /home/geronimo/geronimo/2.1/testsuite/webservices-testsuite/jaxws-tests/jaxws-ejb/src/main/java/org/apache/geronimo/test/GreeterSOAPHandler.java:[41,5]
cannot find symbol
[INFO] symbol  : class Resource
[INFO] location: class org.apache.geronimo.test.GreeterSOAPHandler
[INFO] 
[INFO] /home/geronimo/geronimo/2.1/testsuite/webservices-testsuite/jaxws-tests/jaxws-ejb/src/main/java/org/apache/geronimo/test/GreeterSOAPHandler.java:[44,5]
cannot find symbol
[INFO] symbol  : class Resource
[INFO] location: class org.apache.geronimo.test.GreeterSOAPHandler
[INFO] 
[INFO] /home/geronimo/geronimo/2.1/testsuite/webservices-testsuite/jaxws-tests/jaxws-ejb/src/main/java/org/apache/geronimo/test/GreeterSOAPHandler.java:[47,5]
cannot find symbol
[INFO] symbol  : class PostConstruct
[INFO] location: class org.apache.geronimo.test.GreeterSOAPHandler
[INFO] 
[INFO] /home/geronimo/geronimo/2.1/testsuite/webservices-testsuite/jaxws-tests/jaxws-ejb/src/main/java/org/apache/geronimo/test/GreeterSOAPHandler.java:[52,5]
cannot find symbol
[INFO] symbol  : class PreDestroy
[INFO] location: class org.apache.geronimo.test.GreeterSOAPHandler
[INFO] 
[INFO] 
[INFO] [INFO] ------------------------------------------------------------------------
[INFO] [INFO] Trace
[INFO] org.apache.maven.BuildFailureException: Compilation failure
[INFO] 	at org.apache.maven.lifecycle.DefaultLifecycleExecutor.executeGoals(DefaultLifecycleExecutor.java:560)
[INFO] 	at org.apache.maven.lifecycle.DefaultLifecycleExecutor.executeGoalWithLifecycle(DefaultLifecycleExecutor.java:480)
[INFO] 	at org.apache.maven.lifecycle.DefaultLifecycleExecutor.executeGoal(DefaultLifecycleExecutor.java:459)
[INFO] 	at org.apache.maven.lifecycle.DefaultLifecycleExecutor.executeGoalAndHandleFailures(DefaultLifecycleExecutor.java:311)
[INFO] 	at org.apache.maven.lifecycle.DefaultLifecycleExecutor.executeTaskSegments(DefaultLifecycleExecutor.java:278)
[INFO] 	at org.apache.maven.lifecycle.DefaultLifecycleExecutor.execute(DefaultLifecycleExecutor.java:143)
[INFO] 	at org.apache.maven.DefaultMaven.doExecute(DefaultMaven.java:334)
[INFO] 	at org.apache.maven.DefaultMaven.execute(DefaultMaven.java:125)
[INFO] 	at org.apache.maven.cli.MavenCli.main(MavenCli.java:280)
[INFO] 	at sun.reflect.NativeMethodAccessorImpl.invoke0(Native Method)
[INFO] 	at sun.reflect.NativeMethodAccessorImpl.invoke(NativeMethodAccessorImpl.java:39)
[INFO] 	at sun.reflect.DelegatingMethodAccessorImpl.invoke(DelegatingMethodAccessorImpl.java:25)
[INFO] 	at java.lang.reflect.Method.invoke(Method.java:585)
[INFO] 	at org.codehaus.classworlds.Launcher.launchEnhanced(Launcher.java:315)
[INFO] 	at org.codehaus.classworlds.Launcher.launch(Launcher.java:255)
[INFO] 	at org.codehaus.classworlds.Launcher.mainWithExitCode(Launcher.java:430)
[INFO] 	at org.codehaus.classworlds.Launcher.main(Launcher.java:375)
[INFO] Caused by: org.apache.maven.plugin.CompilationFailureException: Compilation failure
[INFO] 	at org.apache.maven.plugin.AbstractCompilerMojo.execute(AbstractCompilerMojo.java:516)
[INFO] 	at org.apache.maven.plugin.CompilerMojo.execute(CompilerMojo.java:114)
[INFO] 	at org.apache.maven.plugin.DefaultPluginManager.executeMojo(DefaultPluginManager.java:443)
[INFO] 	at org.apache.maven.lifecycle.DefaultLifecycleExecutor.executeGoals(DefaultLifecycleExecutor.java:539)
[INFO] 	... 16 more
[INFO] [INFO] ------------------------------------------------------------------------
[INFO] [INFO] Total time: 58 seconds
[INFO] [INFO] Finished at: Thu Feb 07 09:11:44 EST 2008
[INFO] [INFO] Final Memory: 34M/557M
[INFO] [INFO] ------------------------------------------------------------------------
[INFO] ------------------------------------------------------------------------
[ERROR] BUILD ERROR
 
Assembly: jetty
=================================
See the full test.log file at http://geronimo.apache.org/maven/server/binaries/2.1/20080207/logs-0800-jetty/test.log
 
 
[INFO] [INFO] Loading surefire xml for xmlproperty: /home/geronimo/geronimo/2.1/testsuite/webservices-testsuite/jaxws-tests/jaxws-client/target/surefire-reports/TEST-org.apache.geronimo.mavenplugins.geronimo.module.UndeployModuleMojo.xml
[INFO] [INFO] Loading parent surefire xml for xmlproperty: /home/geronimo/geronimo/2.1/testsuite/webservices-testsuite/target/surefire-reports/TEST-jaxws-client.xml
[INFO] [INFO] Loading surefire xml for xmlproperty: /home/geronimo/geronimo/2.1/testsuite/webservices-testsuite/jaxws-tests/jaxws-client/target/surefire-reports/TEST-org.apache.geronimo.mavenplugins.geronimo.server.RunClientMojo.xml
[INFO] [INFO] Loading parent surefire xml for xmlproperty: /home/geronimo/geronimo/2.1/testsuite/webservices-testsuite/target/surefire-reports/TEST-jaxws-client.xml
[INFO] [INFO] Loading surefire xml for xmlproperty: /home/geronimo/geronimo/2.1/testsuite/webservices-testsuite/jaxws-tests/jaxws-client/target/surefire-reports/TEST-org.apache.geronimo.testsuite.testset.ClientJAXWSTest.xml
[INFO] [INFO] Loading parent surefire xml for xmlproperty: /home/geronimo/geronimo/2.1/testsuite/webservices-testsuite/target/surefire-reports/TEST-jaxws-client.xml
[INFO] [INFO] ----------------------------------------------------------------------------
[INFO] [INFO] Building Geronimo TestSuite :: WebServices TestSuite :: JAX-WS EJB
[INFO] [INFO]    task-segment: [install]
[INFO] [INFO] ----------------------------------------------------------------------------
[INFO] [INFO] [enforcer:enforce {execution: default}]
[INFO] [INFO] [tools:copy-legal-files {execution: install-legal-files}]
[INFO] [INFO] Created dir: /home/geronimo/geronimo/2.1/testsuite/webservices-testsuite/jaxws-tests/jaxws-ejb/target/classes/META-INF
[INFO] [INFO] Copying 2 files to /home/geronimo/geronimo/2.1/testsuite/webservices-testsuite/jaxws-tests/jaxws-ejb/target/classes/META-INF
[INFO] [INFO] [resources:resources]
[INFO] [INFO] Using default encoding to copy filtered resources.
[INFO] [INFO] [compiler:compile]
[INFO] [INFO] Compiling 4 source files to /home/geronimo/geronimo/2.1/testsuite/webservices-testsuite/jaxws-tests/jaxws-ejb/target/classes
[INFO] [INFO] ------------------------------------------------------------------------
[INFO] [ERROR] BUILD FAILURE
[INFO] [INFO] ------------------------------------------------------------------------
[INFO] [INFO] Compilation failure
[INFO] 
[INFO] /home/geronimo/geronimo/2.1/testsuite/webservices-testsuite/jaxws-tests/jaxws-ejb/src/main/java/org/apache/geronimo/test/GreeterLogicalHandler.java:[25,24]
package javax.annotation does not exist
[INFO] 
[INFO] /home/geronimo/geronimo/2.1/testsuite/webservices-testsuite/jaxws-tests/jaxws-ejb/src/main/java/org/apache/geronimo/test/GreeterLogicalHandler.java:[26,24]
package javax.annotation does not exist
[INFO] 
[INFO] /home/geronimo/geronimo/2.1/testsuite/webservices-testsuite/jaxws-tests/jaxws-ejb/src/main/java/org/apache/geronimo/test/GreeterLogicalHandler.java:[27,24]
package javax.annotation does not exist
[INFO] 
[INFO] /home/geronimo/geronimo/2.1/testsuite/webservices-testsuite/jaxws-tests/jaxws-ejb/src/main/java/org/apache/geronimo/test/GreeterSOAPHandler.java:[26,24]
package javax.annotation does not exist
[INFO] 
[INFO] /home/geronimo/geronimo/2.1/testsuite/webservices-testsuite/jaxws-tests/jaxws-ejb/src/main/java/org/apache/geronimo/test/GreeterSOAPHandler.java:[27,24]
package javax.annotation does not exist
[INFO] 
[INFO] /home/geronimo/geronimo/2.1/testsuite/webservices-testsuite/jaxws-tests/jaxws-ejb/src/main/java/org/apache/geronimo/test/GreeterSOAPHandler.java:[28,24]
package javax.annotation does not exist
[INFO] 
[INFO] /home/geronimo/geronimo/2.1/testsuite/webservices-testsuite/jaxws-tests/jaxws-ejb/src/main/java/org/apache/geronimo/test/GreeterLogicalHandler.java:[39,5]
cannot find symbol
[INFO] symbol  : class Resource
[INFO] location: class org.apache.geronimo.test.GreeterLogicalHandler
[INFO] 
[INFO] /home/geronimo/geronimo/2.1/testsuite/webservices-testsuite/jaxws-tests/jaxws-ejb/src/main/java/org/apache/geronimo/test/GreeterLogicalHandler.java:[41,5]
cannot find symbol
[INFO] symbol  : class Resource
[INFO] location: class org.apache.geronimo.test.GreeterLogicalHandler
[INFO] 
[INFO] /home/geronimo/geronimo/2.1/testsuite/webservices-testsuite/jaxws-tests/jaxws-ejb/src/main/java/org/apache/geronimo/test/GreeterLogicalHandler.java:[50,5]
cannot find symbol
[INFO] symbol  : class PostConstruct
[INFO] location: class org.apache.geronimo.test.GreeterLogicalHandler
[INFO] 
[INFO] /home/geronimo/geronimo/2.1/testsuite/webservices-testsuite/jaxws-tests/jaxws-ejb/src/main/java/org/apache/geronimo/test/GreeterLogicalHandler.java:[55,5]
cannot find symbol
[INFO] symbol  : class PreDestroy
[INFO] location: class org.apache.geronimo.test.GreeterLogicalHandler
[INFO] 
[INFO] /home/geronimo/geronimo/2.1/testsuite/webservices-testsuite/jaxws-tests/jaxws-ejb/src/main/java/org/apache/geronimo/test/GreeterSOAPHandler.java:[41,5]
cannot find symbol
[INFO] symbol  : class Resource
[INFO] location: class org.apache.geronimo.test.GreeterSOAPHandler
[INFO] 
[INFO] /home/geronimo/geronimo/2.1/testsuite/webservices-testsuite/jaxws-tests/jaxws-ejb/src/main/java/org/apache/geronimo/test/GreeterSOAPHandler.java:[44,5]
cannot find symbol
[INFO] symbol  : class Resource
[INFO] location: class org.apache.geronimo.test.GreeterSOAPHandler
[INFO] 
[INFO] /home/geronimo/geronimo/2.1/testsuite/webservices-testsuite/jaxws-tests/jaxws-ejb/src/main/java/org/apache/geronimo/test/GreeterSOAPHandler.java:[47,5]
cannot find symbol
[INFO] symbol  : class PostConstruct
[INFO] location: class org.apache.geronimo.test.GreeterSOAPHandler
[INFO] 
[INFO] /home/geronimo/geronimo/2.1/testsuite/webservices-testsuite/jaxws-tests/jaxws-ejb/src/main/java/org/apache/geronimo/test/GreeterSOAPHandler.java:[52,5]
cannot find symbol
[INFO] symbol  : class PreDestroy
[INFO] location: class org.apache.geronimo.test.GreeterSOAPHandler
[INFO] 
[INFO] 
[INFO] [INFO] ------------------------------------------------------------------------
[INFO] [INFO] Trace
[INFO] org.apache.maven.BuildFailureException: Compilation failure
[INFO] 	at org.apache.maven.lifecycle.DefaultLifecycleExecutor.executeGoals(DefaultLifecycleExecutor.java:560)
[INFO] 	at org.apache.maven.lifecycle.DefaultLifecycleExecutor.executeGoalWithLifecycle(DefaultLifecycleExecutor.java:480)
[INFO] 	at org.apache.maven.lifecycle.DefaultLifecycleExecutor.executeGoal(DefaultLifecycleExecutor.java:459)
[INFO] 	at org.apache.maven.lifecycle.DefaultLifecycleExecutor.executeGoalAndHandleFailures(DefaultLifecycleExecutor.java:311)
[INFO] 	at org.apache.maven.lifecycle.DefaultLifecycleExecutor.executeTaskSegments(DefaultLifecycleExecutor.java:278)
[INFO] 	at org.apache.maven.lifecycle.DefaultLifecycleExecutor.execute(DefaultLifecycleExecutor.java:143)
[INFO] 	at org.apache.maven.DefaultMaven.doExecute(DefaultMaven.java:334)
[INFO] 	at org.apache.maven.DefaultMaven.execute(DefaultMaven.java:125)
[INFO] 	at org.apache.maven.cli.MavenCli.main(MavenCli.java:280)
[INFO] 	at sun.reflect.NativeMethodAccessorImpl.invoke0(Native Method)
[INFO] 	at sun.reflect.NativeMethodAccessorImpl.invoke(NativeMethodAccessorImpl.java:39)
[INFO] 	at sun.reflect.DelegatingMethodAccessorImpl.invoke(DelegatingMethodAccessorImpl.java:25)
[INFO] 	at java.lang.reflect.Method.invoke(Method.java:585)
[INFO] 	at org.codehaus.classworlds.Launcher.launchEnhanced(Launcher.java:315)
[INFO] 	at org.codehaus.classworlds.Launcher.launch(Launcher.java:255)
[INFO] 	at org.codehaus.classworlds.Launcher.mainWithExitCode(Launcher.java:430)
[INFO] 	at org.codehaus.classworlds.Launcher.main(Launcher.java:375)
[INFO] Caused by: org.apache.maven.plugin.CompilationFailureException: Compilation failure
[INFO] 	at org.apache.maven.plugin.AbstractCompilerMojo.execute(AbstractCompilerMojo.java:516)
[INFO] 	at org.apache.maven.plugin.CompilerMojo.execute(CompilerMojo.java:114)
[INFO] 	at org.apache.maven.plugin.DefaultPluginManager.executeMojo(DefaultPluginManager.java:443)
[INFO] 	at org.apache.maven.lifecycle.DefaultLifecycleExecutor.executeGoals(DefaultLifecycleExecutor.java:539)
[INFO] 	... 16 more
[INFO] [INFO] ------------------------------------------------------------------------
[INFO] [INFO] Total time: 56 seconds
[INFO] [INFO] Finished at: Thu Feb 07 09:49:45 EST 2008
[INFO] [INFO] Final Memory: 34M/557M
[INFO] [INFO] ------------------------------------------------------------------------
[INFO] ------------------------------------------------------------------------
[ERROR] BUILD ERROR

Mime
View raw message