geronimo-dev mailing list archives

Site index · List index
Message view « Date » · « Thread »
Top « Date » · « Thread »
From pra...@apache.org
Subject [BUILD] 2.1: Failed for Revision: 609390
Date Sun, 06 Jan 2008 22:06:55 GMT
OpenEJB trunk at 609380
Geronimo Revision: 609390 built with tests included
 
See the full build-1500.log file at http://people.apache.org/~prasad/binaries/trunk/20080106/build-1500.log
 
Download the binaries from http://people.apache.org/~prasad/binaries/trunk/20080106
[INFO] BUILD SUCCESSFUL
[INFO] ------------------------------------------------------------------------
[INFO] Total time: 28 minutes 
[INFO] Finished at: Sun Jan 06 15:34:28 EST 2008
[INFO] Final Memory: 294M/994M
[INFO] ------------------------------------------------------------------------
 
TESTSUITE RESULTS (Failures only)
=================================
See detailed results at http://people.apache.org/~prasad/testsuite/ResultsSummary.html
 
Assembly: tomcat
=================================
See the full test.log file at http://people.apache.org/~prasad/binaries/trunk/20080106/logs-1500-tomcat/test.log
 
[INFO] Running console-testsuite.basic-console
[INFO] Tests run: 38, Failures: 1, Errors: 0, Skipped: 0, Time elapsed: 84.699 sec <<<
FAILURE!
[INFO] Running console-testsuite.advance-test
[INFO] Tests run: 12, Failures: 4, Errors: 0, Skipped: 0, Time elapsed: 46.947 sec <<<
FAILURE!
 
Assembly: jetty
=================================
See the full test.log file at http://people.apache.org/~prasad/binaries/trunk/20080106/logs-1500-jetty/test.log
 
[INFO] Running console-testsuite.basic-console
[INFO] Tests run: 38, Failures: 1, Errors: 0, Skipped: 0, Time elapsed: 86.057 sec <<<
FAILURE!
[INFO] Running console-testsuite.advance-test
[INFO] Tests run: 12, Failures: 4, Errors: 0, Skipped: 0, Time elapsed: 43.205 sec <<<
FAILURE!

Mime
View raw message