geronimo-dev mailing list archives

Site index · List index
Message view « Date » · « Thread »
Top « Date » · « Thread »
From pra...@apache.org
Subject [BUILD] 2.1: Failed for Revision: 609311
Date Sun, 06 Jan 2008 16:08:04 GMT
OpenEJB trunk at 609309
Geronimo Revision: 609311 built with tests included
 
See the full build-0900.log file at http://people.apache.org/~prasad/binaries/trunk/20080106/build-0900.log
 
Download the binaries from http://people.apache.org/~prasad/binaries/trunk/20080106
[INFO] BUILD SUCCESSFUL
[INFO] ------------------------------------------------------------------------
[INFO] Total time: 28 minutes 46 seconds
[INFO] Finished at: Sun Jan 06 09:35:00 EST 2008
[INFO] Final Memory: 293M/999M
[INFO] ------------------------------------------------------------------------
 
TESTSUITE RESULTS (Failures only)
=================================
See detailed results at http://people.apache.org/~prasad/testsuite/ResultsSummary.html
 
Assembly: tomcat
=================================
See the full test.log file at http://people.apache.org/~prasad/binaries/trunk/20080106/logs-0900-tomcat/test.log
 
[INFO] Running console-testsuite.basic-console
[INFO] Tests run: 38, Failures: 1, Errors: 0, Skipped: 0, Time elapsed: 85.014 sec <<<
FAILURE!
[INFO] Running console-testsuite.advance-test
[INFO] Tests run: 12, Failures: 4, Errors: 0, Skipped: 0, Time elapsed: 46.854 sec <<<
FAILURE!
 
Assembly: jetty
=================================
See the full test.log file at http://people.apache.org/~prasad/binaries/trunk/20080106/logs-0900-jetty/test.log
 
[INFO] Running console-testsuite.basic-console
[INFO] Tests run: 38, Failures: 1, Errors: 0, Skipped: 0, Time elapsed: 85.852 sec <<<
FAILURE!
[INFO] Running console-testsuite.advance-test
[INFO] Tests run: 12, Failures: 4, Errors: 0, Skipped: 0, Time elapsed: 45.33 sec <<<
FAILURE!

Mime
View raw message