geronimo-dev mailing list archives

Site index · List index
Message view « Date » · « Thread »
Top « Date » · « Thread »
From pra...@apache.org
Subject [BUILD] 2.1: Failed for Revision: 604498
Date Sat, 15 Dec 2007 20:13:33 GMT
OpenEJB trunk at 604487
Geronimo Revision: 604498 built with tests included
 
See the full build-1500.log file at http://people.apache.org/~prasad/binaries/trunk/20071215/build-1500.log
 
Downloading: http://people.apache.org/repo/m2-incubating-repository//asm/asm/2.2.3/asm-2.2.3.jar
Downloading: http://repo1.maven.org/maven2/asm/asm/2.2.3/asm-2.2.3.jar
34K downloaded
[INFO] [enforcer:enforce {execution: default}]
Downloading: http://repo1.maven.org/maven2/org/codehaus/plexus/plexus-velocity/1.1.3/plexus-velocity-1.1.3.pom
976b downloaded
Downloading: http://repo1.maven.org/maven2/org/codehaus/plexus/plexus-components/1.1.5/plexus-components-1.1.5.pom
2K downloaded
Downloading: http://repo1.maven.org/maven2/org/apache/maven/shared/maven-downloader/1.1/maven-downloader-1.1.pom
1K downloaded
Downloading: http://repo1.maven.org/maven2/org/codehaus/plexus/plexus-resources/1.0-alpha-4/plexus-resources-1.0-alpha-4.pom
762b downloaded
Downloading: http://repo1.maven.org/maven2/org/codehaus/plexus/plexus-velocity/1.1.3/plexus-velocity-1.1.3.jar
7K downloaded
Downloading: http://download.java.net/maven/1//commons-collections/jars/commons-collections-2.0.jar
Downloading: http://people.apache.org/repo/m2-incubating-repository//commons-collections/commons-collections/2.0/commons-collections-2.0.jar
Downloading: http://repo1.maven.org/maven2/commons-collections/commons-collections/2.0/commons-collections-2.0.jar
88K downloaded
Downloading: http://repo1.maven.org/maven2/org/codehaus/plexus/plexus-resources/1.0-alpha-4/plexus-resources-1.0-alpha-4.jar
16K downloaded
Downloading: http://repo1.maven.org/maven2/org/apache/maven/shared/maven-downloader/1.1/maven-downloader-1.1.jar
6K downloaded
[INFO] Setting property: classpath.resource.loader.class => 'org.codehaus.plexus.velocity.ContextClassLoaderResourceLoader'.
[INFO] Setting property: velocimacro.messages.on => 'false'.
[INFO] Setting property: resource.loader => 'classpath'.
[INFO] Setting property: resource.manager.logwhenfound => 'false'.
[INFO] [remote-resources:process {execution: default}]
Downloading: http://download.java.net/maven/1//org.apache/jars/apache-jar-resource-bundle-1.0.jar
Downloading: http://people.apache.org/repo/m2-incubating-repository//org/apache/apache-jar-resource-bundle/1.0/apache-jar-resource-bundle-1.0.jar
Downloading: http://repo1.maven.org/maven2/org/apache/apache-jar-resource-bundle/1.0/apache-jar-resource-bundle-1.0.jar
6K downloaded
[WARNING] org.apache.velocity.runtime.exception.ReferenceException: reference : template =
META-INF/NOTICE.vm [line 14,column 1] : $project.organization.name is not a valid reference.
[WARNING] org.apache.velocity.runtime.exception.ReferenceException: reference : template =
META-INF/NOTICE.vm [line 14,column 29] : $project.organization.url is not a valid reference.
[WARNING] org.apache.velocity.runtime.exception.ReferenceException: reference : template =
META-INF/NOTICE.vm [line 14,column 1] : $project.organization.name is not a valid reference.
[WARNING] org.apache.velocity.runtime.exception.ReferenceException: reference : template =
META-INF/NOTICE.vm [line 14,column 29] : $project.organization.url is not a valid reference.
[WARNING] org.apache.velocity.runtime.exception.ReferenceException: reference : template =
META-INF/NOTICE.vm [line 14,column 1] : $project.organization.name is not a valid reference.
[WARNING] org.apache.velocity.runtime.exception.ReferenceException: reference : template =
META-INF/NOTICE.vm [line 14,column 29] : $project.organization.url is not a valid reference.
[INFO] [tools:copy-legal-files {execution: install-legal-files}]
[INFO] Created dir: /home/prasad/geronimo/trunk/framework/modules/geronimo-kernel/target/classes/META-INF
[INFO] Copying 2 files to /home/prasad/geronimo/trunk/framework/modules/geronimo-kernel/target/classes/META-INF
[INFO] [resources:resources]
[INFO] Using default encoding to copy filtered resources.
[INFO] [compiler:compile]
[INFO] Compiling 189 source files to /home/prasad/geronimo/trunk/framework/modules/geronimo-kernel/target/classes
[INFO] ------------------------------------------------------------------------
[ERROR] BUILD FAILURE
[INFO] ------------------------------------------------------------------------
[INFO] Compilation failure
/home/prasad/geronimo/trunk/framework/modules/geronimo-kernel/src/main/java/org/apache/geronimo/kernel/config/Configuration.java:[558,55]
incompatible types
found   : java.util.Set<org.apache.geronimo.kernel.repository.Artifact>
required: java.util.Set<org.apache.geronimo.kernel.config.Configuration>



/home/prasad/geronimo/trunk/framework/modules/geronimo-kernel/src/main/java/org/apache/geronimo/kernel/config/Configuration.java:[558,55]
incompatible types
found   : java.util.Set<org.apache.geronimo.kernel.repository.Artifact>
required: java.util.Set<org.apache.geronimo.kernel.config.Configuration>


[INFO] ------------------------------------------------------------------------
[INFO] Trace
org.apache.maven.BuildFailureException: Compilation failure
/home/prasad/geronimo/trunk/framework/modules/geronimo-kernel/src/main/java/org/apache/geronimo/kernel/config/Configuration.java:[558,55]
incompatible types
found   : java.util.Set<org.apache.geronimo.kernel.repository.Artifact>
required: java.util.Set<org.apache.geronimo.kernel.config.Configuration>


	at org.apache.maven.lifecycle.DefaultLifecycleExecutor.executeGoals(DefaultLifecycleExecutor.java:560)
	at org.apache.maven.lifecycle.DefaultLifecycleExecutor.executeGoalWithLifecycle(DefaultLifecycleExecutor.java:480)
	at org.apache.maven.lifecycle.DefaultLifecycleExecutor.executeGoal(DefaultLifecycleExecutor.java:459)
	at org.apache.maven.lifecycle.DefaultLifecycleExecutor.executeGoalAndHandleFailures(DefaultLifecycleExecutor.java:311)
	at org.apache.maven.lifecycle.DefaultLifecycleExecutor.executeTaskSegments(DefaultLifecycleExecutor.java:278)
	at org.apache.maven.lifecycle.DefaultLifecycleExecutor.execute(DefaultLifecycleExecutor.java:143)
	at org.apache.maven.DefaultMaven.doExecute(DefaultMaven.java:334)
	at org.apache.maven.DefaultMaven.execute(DefaultMaven.java:125)
	at org.apache.maven.cli.MavenCli.main(MavenCli.java:280)
	at sun.reflect.NativeMethodAccessorImpl.invoke0(Native Method)
	at sun.reflect.NativeMethodAccessorImpl.invoke(NativeMethodAccessorImpl.java:39)
	at sun.reflect.DelegatingMethodAccessorImpl.invoke(DelegatingMethodAccessorImpl.java:25)
	at java.lang.reflect.Method.invoke(Method.java:585)
	at org.codehaus.classworlds.Launcher.launchEnhanced(Launcher.java:315)
	at org.codehaus.classworlds.Launcher.launch(Launcher.java:255)
	at org.codehaus.classworlds.Launcher.mainWithExitCode(Launcher.java:430)
	at org.codehaus.classworlds.Launcher.main(Launcher.java:375)
Caused by: org.apache.maven.plugin.CompilationFailureException: Compilation failure
/home/prasad/geronimo/trunk/framework/modules/geronimo-kernel/src/main/java/org/apache/geronimo/kernel/config/Configuration.java:[558,55]
incompatible types
found   : java.util.Set<org.apache.geronimo.kernel.repository.Artifact>
required: java.util.Set<org.apache.geronimo.kernel.config.Configuration>


	at org.apache.maven.plugin.AbstractCompilerMojo.execute(AbstractCompilerMojo.java:516)
	at org.apache.maven.plugin.CompilerMojo.execute(CompilerMojo.java:114)
	at org.apache.maven.plugin.DefaultPluginManager.executeMojo(DefaultPluginManager.java:443)
	at org.apache.maven.lifecycle.DefaultLifecycleExecutor.executeGoals(DefaultLifecycleExecutor.java:539)
	... 16 more
[INFO] ------------------------------------------------------------------------
[INFO] Total time: 3 minutes 16 seconds
[INFO] Finished at: Sat Dec 15 15:09:58 EST 2007
[INFO] Final Memory: 113M/549M
[INFO] ------------------------------------------------------------------------

Mime
View raw message