geronimo-dev mailing list archives

Site index · List index
Message view « Date » · « Thread »
Top « Date » · « Thread »
From pra...@apache.org
Subject [BUILD] 2.1: Failed for Revision: 604123
Date Fri, 14 Dec 2007 08:29:06 GMT
OpenEJB trunk at 604115
Geronimo Revision: 604123 built with tests included
 
See the full build-0300.log file at http://people.apache.org/~prasad/binaries/trunk/20071214/build-0300.log
 
[WARNING] Component returned which is not the same manager. Ignored. component=org.apache.maven.profiles.activation.SystemPropertyProfileActivator@22602260
[WARNING] Component returned which is not the same manager. Ignored. component=org.apache.maven.profiles.activation.SystemPropertyProfileActivator@22602260
[WARNING] Component returned which is not the same manager. Ignored. component=org.apache.maven.profiles.activation.SystemPropertyProfileActivator@22602260
[WARNING] Component returned which is not the same manager. Ignored. component=org.apache.maven.profiles.activation.SystemPropertyProfileActivator@22602260
[WARNING] Component returned which is not the same manager. Ignored. component=org.apache.maven.profiles.activation.SystemPropertyProfileActivator@22602260
Downloading: http://people.apache.org/repo/m2-snapshot-repository/org/apache/openejb/openejb-jee/3.0.0-SNAPSHOT/openejb-jee-3.0.0-20071214.081732-33.pom
2K downloaded
[WARNING] Component returned which is not the same manager. Ignored. component=org.apache.maven.profiles.activation.SystemPropertyProfileActivator@22602260
[WARNING] Component returned which is not the same manager. Ignored. component=org.apache.maven.profiles.activation.SystemPropertyProfileActivator@22602260
[WARNING] Component returned which is not the same manager. Ignored. component=org.apache.maven.profiles.activation.SystemPropertyProfileActivator@22602260
[WARNING] Component returned which is not the same manager. Ignored. component=org.apache.maven.profiles.activation.SystemPropertyProfileActivator@22602260
Downloading: http://people.apache.org/repo/m2-snapshot-repository/org/apache/openejb/openejb-javaagent/3.0.0-SNAPSHOT/openejb-javaagent-3.0.0-20071214.081732-33.pom
2K downloaded
[WARNING] Component returned which is not the same manager. Ignored. component=org.apache.maven.wagon.providers.http.LightweightHttpWagon@7ae67ae6
[WARNING] Component returned which is not the same manager. Ignored. component=org.apache.maven.profiles.activation.SystemPropertyProfileActivator@22602260
[WARNING] Component returned which is not the same manager. Ignored. component=org.apache.maven.profiles.activation.SystemPropertyProfileActivator@22602260
[WARNING] Component returned which is not the same manager. Ignored. component=org.apache.maven.profiles.activation.SystemPropertyProfileActivator@22602260
[WARNING] Component returned which is not the same manager. Ignored. component=org.apache.maven.profiles.activation.SystemPropertyProfileActivator@22602260
Downloading: http://people.apache.org/repo/m2-snapshot-repository/org/apache/openejb/openejb-ejbd/3.0.0-SNAPSHOT/openejb-ejbd-3.0.0-20071214.081732-30.pom
4K downloaded
[WARNING] Component returned which is not the same manager. Ignored. component=org.apache.maven.profiles.activation.SystemPropertyProfileActivator@22602260
[WARNING] Component returned which is not the same manager. Ignored. component=org.apache.maven.profiles.activation.SystemPropertyProfileActivator@22602260
[WARNING] Component returned which is not the same manager. Ignored. component=org.apache.maven.profiles.activation.SystemPropertyProfileActivator@22602260
[WARNING] Component returned which is not the same manager. Ignored. component=org.apache.maven.profiles.activation.SystemPropertyProfileActivator@22602260
Downloading: http://people.apache.org/repo/m2-snapshot-repository/org/apache/openejb/openejb-server/3.0.0-SNAPSHOT/openejb-server-3.0.0-20071214.081732-30.pom
2K downloaded
[WARNING] Component returned which is not the same manager. Ignored. component=org.apache.maven.profiles.activation.SystemPropertyProfileActivator@22602260
[WARNING] Component returned which is not the same manager. Ignored. component=org.apache.maven.profiles.activation.SystemPropertyProfileActivator@22602260
[WARNING] Component returned which is not the same manager. Ignored. component=org.apache.maven.profiles.activation.SystemPropertyProfileActivator@22602260
[WARNING] Component returned which is not the same manager. Ignored. component=org.apache.maven.profiles.activation.SystemPropertyProfileActivator@22602260
Downloading: http://people.apache.org/repo/m2-snapshot-repository/org/apache/openejb/openejb-loader/3.0.0-SNAPSHOT/openejb-loader-3.0.0-20071214.081732-33.pom
1K downloaded
[WARNING] Component returned which is not the same manager. Ignored. component=org.apache.maven.profiles.activation.SystemPropertyProfileActivator@22602260
[WARNING] Component returned which is not the same manager. Ignored. component=org.apache.maven.profiles.activation.SystemPropertyProfileActivator@22602260
[WARNING] Component returned which is not the same manager. Ignored. component=org.apache.maven.profiles.activation.SystemPropertyProfileActivator@22602260
[WARNING] Component returned which is not the same manager. Ignored. component=org.apache.maven.profiles.activation.SystemPropertyProfileActivator@22602260
Downloading: http://people.apache.org/repo/m2-snapshot-repository/org/apache/openejb/openejb-client/3.0.0-SNAPSHOT/openejb-client-3.0.0-20071214.081732-30.pom
3K downloaded
[WARNING] Component returned which is not the same manager. Ignored. component=org.apache.maven.profiles.activation.SystemPropertyProfileActivator@22602260
[WARNING] Component returned which is not the same manager. Ignored. component=org.apache.maven.profiles.activation.SystemPropertyProfileActivator@22602260
[WARNING] Component returned which is not the same manager. Ignored. component=org.apache.maven.profiles.activation.SystemPropertyProfileActivator@22602260
[WARNING] Component returned which is not the same manager. Ignored. component=org.apache.maven.profiles.activation.SystemPropertyProfileActivator@22602260
[INFO] [compiler:compile]
[INFO] Compiling 21 source files to /home/prasad/geronimo/trunk/plugins/openejb/geronimo-openejb/target/classes
[INFO] ------------------------------------------------------------------------
[ERROR] BUILD FAILURE
[INFO] ------------------------------------------------------------------------
[INFO] Compilation failure
/home/prasad/geronimo/trunk/plugins/openejb/geronimo-openejb/src/main/java/org/apache/geronimo/openejb/OpenEjbSystemGBean.java:[358,21]
cannot find symbol
symbol  : method createEjbJar(org.apache.openejb.assembler.classic.EjbJarInfo,org.apache.openejb.assembler.classic.LinkResolver<javax.persistence.EntityManagerFactory>,java.lang.ClassLoader)
location: class org.apache.openejb.assembler.classic.Assembler



/home/prasad/geronimo/trunk/plugins/openejb/geronimo-openejb/src/main/java/org/apache/geronimo/openejb/OpenEjbSystemGBean.java:[358,21]
cannot find symbol
symbol  : method createEjbJar(org.apache.openejb.assembler.classic.EjbJarInfo,org.apache.openejb.assembler.classic.LinkResolver<javax.persistence.EntityManagerFactory>,java.lang.ClassLoader)
location: class org.apache.openejb.assembler.classic.Assembler


[INFO] ------------------------------------------------------------------------
[INFO] Trace
org.apache.maven.BuildFailureException: Compilation failure
/home/prasad/geronimo/trunk/plugins/openejb/geronimo-openejb/src/main/java/org/apache/geronimo/openejb/OpenEjbSystemGBean.java:[358,21]
cannot find symbol
symbol  : method createEjbJar(org.apache.openejb.assembler.classic.EjbJarInfo,org.apache.openejb.assembler.classic.LinkResolver<javax.persistence.EntityManagerFactory>,java.lang.ClassLoader)
location: class org.apache.openejb.assembler.classic.Assembler


	at org.apache.maven.lifecycle.DefaultLifecycleExecutor.executeGoals(DefaultLifecycleExecutor.java:560)
	at org.apache.maven.lifecycle.DefaultLifecycleExecutor.executeGoalWithLifecycle(DefaultLifecycleExecutor.java:480)
	at org.apache.maven.lifecycle.DefaultLifecycleExecutor.executeGoal(DefaultLifecycleExecutor.java:459)
	at org.apache.maven.lifecycle.DefaultLifecycleExecutor.executeGoalAndHandleFailures(DefaultLifecycleExecutor.java:311)
	at org.apache.maven.lifecycle.DefaultLifecycleExecutor.executeTaskSegments(DefaultLifecycleExecutor.java:278)
	at org.apache.maven.lifecycle.DefaultLifecycleExecutor.execute(DefaultLifecycleExecutor.java:143)
	at org.apache.maven.DefaultMaven.doExecute(DefaultMaven.java:334)
	at org.apache.maven.DefaultMaven.execute(DefaultMaven.java:125)
	at org.apache.maven.cli.MavenCli.main(MavenCli.java:280)
	at sun.reflect.NativeMethodAccessorImpl.invoke0(Native Method)
	at sun.reflect.NativeMethodAccessorImpl.invoke(NativeMethodAccessorImpl.java:79)
	at sun.reflect.DelegatingMethodAccessorImpl.invoke(DelegatingMethodAccessorImpl.java:43)
	at java.lang.reflect.Method.invoke(Method.java:618)
	at org.codehaus.classworlds.Launcher.launchEnhanced(Launcher.java:315)
	at org.codehaus.classworlds.Launcher.launch(Launcher.java:255)
	at org.codehaus.classworlds.Launcher.mainWithExitCode(Launcher.java:430)
	at org.codehaus.classworlds.Launcher.main(Launcher.java:375)
Caused by: org.apache.maven.plugin.CompilationFailureException: Compilation failure
/home/prasad/geronimo/trunk/plugins/openejb/geronimo-openejb/src/main/java/org/apache/geronimo/openejb/OpenEjbSystemGBean.java:[358,21]
cannot find symbol
symbol  : method createEjbJar(org.apache.openejb.assembler.classic.EjbJarInfo,org.apache.openejb.assembler.classic.LinkResolver<javax.persistence.EntityManagerFactory>,java.lang.ClassLoader)
location: class org.apache.openejb.assembler.classic.Assembler


	at org.apache.maven.plugin.AbstractCompilerMojo.execute(AbstractCompilerMojo.java:516)
	at org.apache.maven.plugin.CompilerMojo.execute(CompilerMojo.java:114)
	at org.apache.maven.plugin.DefaultPluginManager.executeMojo(DefaultPluginManager.java:443)
	at org.apache.maven.lifecycle.DefaultLifecycleExecutor.executeGoals(DefaultLifecycleExecutor.java:539)
	... 16 more
[INFO] ------------------------------------------------------------------------
[INFO] Total time: 17 minutes 40 seconds
[INFO] Finished at: Fri Dec 14 03:25:30 EST 2007
[INFO] Final Memory: 204M/810M
[INFO] ------------------------------------------------------------------------

Mime
View raw message