geronimo-dev mailing list archives

Site index · List index
Message view « Date » · « Thread »
Top « Date » · « Thread »
From pra...@apache.org
Subject [BUILD] 2.1: Failed for Revision: 603437
Date Wed, 12 Dec 2007 04:13:43 GMT
OpenEJB trunk at 603432
Geronimo Revision: 603437 built with tests included
 
See the full build-2100.log file at http://people.apache.org/~prasad/binaries/trunk/20071211/build-2100.log
 
Download the binaries from http://people.apache.org/~prasad/binaries/trunk/20071211
[INFO] BUILD SUCCESSFUL
[INFO] ------------------------------------------------------------------------
[INFO] Total time: 28 minutes 5 seconds
[INFO] Finished at: Tue Dec 11 21:36:06 EST 2007
[INFO] Final Memory: 295M/993M
[INFO] ------------------------------------------------------------------------
 
TESTSUITE RESULTS (Failures only)
=================================
See detailed results at http://people.apache.org/~prasad/testsuite/ResultsSummary.html
 
Assembly: tomcat
=================================
See the full test.log file at http://people.apache.org/~prasad/binaries/trunk/20071211/logs-2100-tomcat/test.log
 
[INFO] Running console-testsuite.advance-test
[INFO] Tests run: 12, Failures: 1, Errors: 0, Skipped: 0, Time elapsed: 52.741 sec <<<
FAILURE!
--
[INFO] Running deployment-testsuite.deployment
[INFO] Tests run: 2, Failures: 1, Errors: 0, Skipped: 0, Time elapsed: 0.273 sec <<<
FAILURE!
[INFO] Running jpa-testsuite.jpa
[INFO] Tests run: 1, Failures: 1, Errors: 0, Skipped: 0, Time elapsed: 0.275 sec <<<
FAILURE!
 
Assembly: jetty
=================================
See the full test.log file at http://people.apache.org/~prasad/binaries/trunk/20071211/logs-2100-jetty/test.log
 
[INFO] Running console-testsuite.advance-test
[INFO] Tests run: 12, Failures: 1, Errors: 0, Skipped: 0, Time elapsed: 53.796 sec <<<
FAILURE!
--
[INFO] Running deployment-testsuite.deployment
[INFO] Tests run: 2, Failures: 1, Errors: 0, Skipped: 0, Time elapsed: 0.273 sec <<<
FAILURE!
[INFO] Running jpa-testsuite.jpa
[INFO] Tests run: 1, Failures: 1, Errors: 0, Skipped: 0, Time elapsed: 0.306 sec <<<
FAILURE!

Mime
View raw message