geronimo-dev mailing list archives

Site index · List index
Message view « Date » · « Thread »
Top « Date » · « Thread »
From pra...@apache.org
Subject [BUILD] 2.1: Failed for Revision: 598849
Date Wed, 28 Nov 2007 02:24:59 GMT
OpenEJB trunk at 598731
Geronimo Revision: 598849 built with tests included
 
See the full build-2100.log file at http://people.apache.org/~prasad/binaries/trunk/20071127/build-2100.log
 
[INFO] Created dir: /home/prasad/geronimo/trunk/plugins/connector/geronimo-connector-builder/target/clover/classes
[INFO] Copying 62 files to /home/prasad/geronimo/trunk/plugins/connector/geronimo-connector-builder/target/clover/classes
[INFO] [resources:resources]
[INFO] Using default encoding to copy filtered resources.
[INFO] [compiler:compile]
[INFO] Compiling 31 source files to /home/prasad/geronimo/trunk/plugins/connector/geronimo-connector-builder/target/classes
[INFO] [resources:testResources]
[INFO] Using default encoding to copy filtered resources.
[INFO] [antrun:run {execution: default}]
[INFO] Executing tasks

default:
    [mkdir] Created dir: /home/prasad/geronimo/trunk/plugins/connector/geronimo-connector-builder/target/test-rar-10/META-INF
     [copy] Copying 2 files to /home/prasad/geronimo/trunk/plugins/connector/geronimo-connector-builder/target/test-rar-10/META-INF
      [jar] Building jar: /home/prasad/geronimo/trunk/plugins/connector/geronimo-connector-builder/target/test-rar-10.rar
    [mkdir] Created dir: /home/prasad/geronimo/trunk/plugins/connector/geronimo-connector-builder/target/test-rar-15/META-INF
     [copy] Copying 2 files to /home/prasad/geronimo/trunk/plugins/connector/geronimo-connector-builder/target/test-rar-15/META-INF
      [jar] Building jar: /home/prasad/geronimo/trunk/plugins/connector/geronimo-connector-builder/target/test-rar-15.rar
    [mkdir] Created dir: /home/prasad/geronimo/trunk/plugins/connector/geronimo-connector-builder/target/test-rar-15-notx/META-INF
     [copy] Copying 2 files to /home/prasad/geronimo/trunk/plugins/connector/geronimo-connector-builder/target/test-rar-15-notx/META-INF
      [jar] Building jar: /home/prasad/geronimo/trunk/plugins/connector/geronimo-connector-builder/target/test-rar-15-notx.rar
    [mkdir] Created dir: /home/prasad/geronimo/trunk/plugins/connector/geronimo-connector-builder/target/test-rar-15-localtx/META-INF
     [copy] Copying 2 files to /home/prasad/geronimo/trunk/plugins/connector/geronimo-connector-builder/target/test-rar-15-localtx/META-INF
      [jar] Building jar: /home/prasad/geronimo/trunk/plugins/connector/geronimo-connector-builder/target/test-rar-15-localtx.rar
      [jar] Building jar: /home/prasad/geronimo/trunk/plugins/connector/geronimo-connector-builder/target/test-ear.ear
    [mkdir] Created dir: /home/prasad/geronimo/trunk/plugins/connector/geronimo-connector-builder/target/test-rar-10-noger/META-INF
     [copy] Copying 1 file to /home/prasad/geronimo/trunk/plugins/connector/geronimo-connector-builder/target/test-rar-10-noger/META-INF
      [jar] Building jar: /home/prasad/geronimo/trunk/plugins/connector/geronimo-connector-builder/target/test-rar-10-noger.rar
    [mkdir] Created dir: /home/prasad/geronimo/trunk/plugins/connector/geronimo-connector-builder/target/test-rar-15-noger/META-INF
     [copy] Copying 1 file to /home/prasad/geronimo/trunk/plugins/connector/geronimo-connector-builder/target/test-rar-15-noger/META-INF
      [jar] Building jar: /home/prasad/geronimo/trunk/plugins/connector/geronimo-connector-builder/target/test-rar-15-noger.rar
      [jar] Building jar: /home/prasad/geronimo/trunk/plugins/connector/geronimo-connector-builder/target/test-ear-noger.ear
[INFO] Executed tasks
[INFO] [compiler:testCompile]
[INFO] Compiling 23 source files to /home/prasad/geronimo/trunk/plugins/connector/geronimo-connector-builder/target/test-classes
[INFO] [surefire:test]
[INFO] Surefire report directory: /home/prasad/geronimo/trunk/plugins/connector/geronimo-connector-builder/target/surefire-reports

-------------------------------------------------------
 T E S T S
-------------------------------------------------------
Running org.apache.geronimo.connector.deployment.ConnectorModuleBuilderTest
Tests run: 10, Failures: 0, Errors: 2, Skipped: 0, Time elapsed: 9.593 sec <<< FAILURE!
Running org.apache.geronimo.connector.deployment.annotation.ResourceAnnotationTest
Tests run: 0, Failures: 0, Errors: 0, Skipped: 0, Time elapsed: 0.011 sec
Running org.apache.geronimo.connector.deployment.RAR_1_5DConfigBeanTest
Tests run: 1, Failures: 0, Errors: 0, Skipped: 0, Time elapsed: 0.011 sec
Running org.apache.geronimo.connector.deployment.RAR_1_0DConfigBeanTest
Tests run: 1, Failures: 0, Errors: 0, Skipped: 0, Time elapsed: 0.012 sec
Running org.apache.geronimo.connector.deployment.annotation.AnnotationHelperTest
Tests run: 1, Failures: 0, Errors: 0, Skipped: 0, Time elapsed: 0.361 sec
Running org.apache.geronimo.connector.deployment.MessageDestinationTest
Tests run: 3, Failures: 0, Errors: 0, Skipped: 0, Time elapsed: 0.099 sec
Running org.apache.geronimo.connector.deployment.SchemaConversionTest
Tests run: 1, Failures: 0, Errors: 0, Skipped: 0, Time elapsed: 0.042 sec
Running org.apache.geronimo.connector.deployment.PlanParsingTest
Tests run: 7, Failures: 0, Errors: 0, Skipped: 0, Time elapsed: 0.149 sec

Results :

Tests in error: 
  testBuildUnpackedModule15(org.apache.geronimo.connector.deployment.ConnectorModuleBuilderTest)
  testBuildPackedModule15(org.apache.geronimo.connector.deployment.ConnectorModuleBuilderTest)

Tests run: 24, Failures: 0, Errors: 2, Skipped: 0

[INFO] ------------------------------------------------------------------------
[ERROR] BUILD FAILURE
[INFO] ------------------------------------------------------------------------
[INFO] There are test failures.
[INFO] ------------------------------------------------------------------------
[INFO] Trace
org.apache.maven.BuildFailureException: There are test failures.
	at org.apache.maven.lifecycle.DefaultLifecycleExecutor.executeGoals(DefaultLifecycleExecutor.java:560)
	at org.apache.maven.lifecycle.DefaultLifecycleExecutor.executeGoalWithLifecycle(DefaultLifecycleExecutor.java:480)
	at org.apache.maven.lifecycle.DefaultLifecycleExecutor.executeGoal(DefaultLifecycleExecutor.java:459)
	at org.apache.maven.lifecycle.DefaultLifecycleExecutor.executeGoalAndHandleFailures(DefaultLifecycleExecutor.java:311)
	at org.apache.maven.lifecycle.DefaultLifecycleExecutor.executeTaskSegments(DefaultLifecycleExecutor.java:278)
	at org.apache.maven.lifecycle.DefaultLifecycleExecutor.execute(DefaultLifecycleExecutor.java:143)
	at org.apache.maven.DefaultMaven.doExecute(DefaultMaven.java:334)
	at org.apache.maven.DefaultMaven.execute(DefaultMaven.java:125)
	at org.apache.maven.cli.MavenCli.main(MavenCli.java:280)
	at sun.reflect.NativeMethodAccessorImpl.invoke0(Native Method)
	at sun.reflect.NativeMethodAccessorImpl.invoke(NativeMethodAccessorImpl.java:39)
	at sun.reflect.DelegatingMethodAccessorImpl.invoke(DelegatingMethodAccessorImpl.java:25)
	at java.lang.reflect.Method.invoke(Method.java:585)
	at org.codehaus.classworlds.Launcher.launchEnhanced(Launcher.java:315)
	at org.codehaus.classworlds.Launcher.launch(Launcher.java:255)
	at org.codehaus.classworlds.Launcher.mainWithExitCode(Launcher.java:430)
	at org.codehaus.classworlds.Launcher.main(Launcher.java:375)
Caused by: org.apache.maven.plugin.MojoFailureException: There are test failures.
	at org.apache.maven.plugin.surefire.SurefirePlugin.execute(SurefirePlugin.java:425)
	at org.apache.maven.plugin.DefaultPluginManager.executeMojo(DefaultPluginManager.java:443)
	at org.apache.maven.lifecycle.DefaultLifecycleExecutor.executeGoals(DefaultLifecycleExecutor.java:539)
	... 16 more
[INFO] ------------------------------------------------------------------------
[INFO] Total time: 13 minutes 47 seconds
[INFO] Finished at: Tue Nov 27 21:21:48 EST 2007
[INFO] Final Memory: 176M/539M
[INFO] ------------------------------------------------------------------------

Mime
View raw message