geronimo-dev mailing list archives

Site index · List index
Message view « Date » · « Thread »
Top « Date » · « Thread »
From pra...@apache.org
Subject [BUILD] 2.0: Failed for Revision: 597320
Date Thu, 22 Nov 2007 08:50:42 GMT
Geronimo Revision: 597320 built with tests included
 
See the full build-0300.log file at http://people.apache.org/~prasad/binaries/2.0/20071122/build-0300.log
 
Download the binaries from http://people.apache.org/~prasad/binaries/2.0/20071122
[INFO] BUILD SUCCESSFUL
[INFO] ------------------------------------------------------------------------
[INFO] Total time: 23 minutes 31 seconds
[INFO] Finished at: Thu Nov 22 03:29:08 EST 2007
[INFO] Final Memory: 200M/1001M
[INFO] ------------------------------------------------------------------------
 
TESTSUITE RESULTS (Failures only)
=================================
See detailed results at http://people.apache.org/~prasad/testsuite/ResultsSummary.html
See the full test.log file at http://people.apache.org/~prasad/binaries/2.0/20071122/logs-0300/test.log
 
[INFO] Running console-testsuite.basic-console
[INFO] Tests run: 38, Failures: 38, Errors: 0, Skipped: 0, Time elapsed: 0.338 sec <<<
FAILURE!
[INFO] Running console-testsuite.advance-test
[INFO] Tests run: 12, Failures: 12, Errors: 0, Skipped: 0, Time elapsed: 0.192 sec <<<
FAILURE!
--
[INFO] Running corba-testsuite.corba-mytime
[INFO] Tests run: 1, Failures: 1, Errors: 0, Skipped: 0, Time elapsed: 0.047 sec <<<
FAILURE!
[INFO] Running deployment-testsuite.deployment
[INFO] Tests run: 2, Failures: 1, Errors: 0, Skipped: 0, Time elapsed: 0.054 sec <<<
FAILURE!
[INFO] Running deployment-testsuite.jca-cms
[INFO] Tests run: 2, Failures: 2, Errors: 0, Skipped: 0, Time elapsed: 0.326 sec <<<
FAILURE!
[INFO] Running enterprise-testsuite.jms
[INFO] Tests run: 1, Failures: 1, Errors: 0, Skipped: 0, Time elapsed: 0.043 sec <<<
FAILURE!
[INFO] Running jpa-testsuite.jpa
[INFO] Tests run: 1, Failures: 1, Errors: 0, Skipped: 0, Time elapsed: 0.047 sec <<<
FAILURE!
[INFO] Running sec-testsuite.security
[INFO] Tests run: 2, Failures: 2, Errors: 0, Skipped: 0, Time elapsed: 0.055 sec <<<
FAILURE!
[INFO] Running web-testsuite.jsps
[INFO] Tests run: 4, Failures: 4, Errors: 0, Skipped: 0, Time elapsed: 0.074 sec <<<
FAILURE!
[INFO] Running web-testsuite.myfaces
[INFO] Tests run: 1, Failures: 1, Errors: 0, Skipped: 0, Time elapsed: 0.053 sec <<<
FAILURE!
--
[INFO] Running web-testsuite.security
[INFO] Tests run: 1, Failures: 1, Errors: 0, Skipped: 0, Time elapsed: 0.043 sec <<<
FAILURE!
[INFO] Running web-testsuite.references
[INFO] Tests run: 1, Failures: 1, Errors: 0, Skipped: 0, Time elapsed: 0.051 sec <<<
FAILURE!
[INFO] Running web-testsuite.servlets
[INFO] Tests run: 2, Failures: 2, Errors: 0, Skipped: 0, Time elapsed: 0.072 sec <<<
FAILURE!
 

Mime
View raw message