geronimo-dev mailing list archives

Site index · List index
Message view « Date » · « Thread »
Top « Date » · « Thread »
From pra...@apache.org
Subject [BUILD] 2.0: Failed for Revision: 597282
Date Thu, 22 Nov 2007 02:59:12 GMT
Geronimo Revision: 597282 built with tests included
 
See the full build-2100.log file at http://people.apache.org/~prasad/binaries/2.0/20071121/build-2100.log
 
Download the binaries from http://people.apache.org/~prasad/binaries/2.0/20071121
[INFO] BUILD SUCCESSFUL
[INFO] ------------------------------------------------------------------------
[INFO] Total time: 29 minutes 4 seconds
[INFO] Finished at: Wed Nov 21 21:37:06 EST 2007
[INFO] Final Memory: 200M/998M
[INFO] ------------------------------------------------------------------------
 
TESTSUITE RESULTS (Failures only)
=================================
See detailed results at http://people.apache.org/~prasad/testsuite/ResultsSummary.html
See the full test.log file at http://people.apache.org/~prasad/binaries/2.0/20071121/logs-2100/test.log
 
[INFO] Running console-testsuite.basic-console
[INFO] Tests run: 38, Failures: 38, Errors: 0, Skipped: 0, Time elapsed: 0.344 sec <<<
FAILURE!
[INFO] Running console-testsuite.advance-test
[INFO] Tests run: 12, Failures: 12, Errors: 0, Skipped: 0, Time elapsed: 0.181 sec <<<
FAILURE!
--
[INFO] Running corba-testsuite.corba-mytime
[INFO] Tests run: 1, Failures: 1, Errors: 0, Skipped: 0, Time elapsed: 0.045 sec <<<
FAILURE!
[INFO] Running deployment-testsuite.deployment
[INFO] Tests run: 2, Failures: 1, Errors: 0, Skipped: 0, Time elapsed: 0.061 sec <<<
FAILURE!
[INFO] Running deployment-testsuite.jca-cms
[INFO] Tests run: 2, Failures: 2, Errors: 0, Skipped: 0, Time elapsed: 0.054 sec <<<
FAILURE!
[INFO] Running enterprise-testsuite.jms
[INFO] Tests run: 1, Failures: 1, Errors: 0, Skipped: 0, Time elapsed: 0.041 sec <<<
FAILURE!
[INFO] Running jpa-testsuite.jpa
[INFO] Tests run: 1, Failures: 1, Errors: 0, Skipped: 0, Time elapsed: 0.054 sec <<<
FAILURE!
[INFO] Running sec-testsuite.security
[INFO] Tests run: 2, Failures: 2, Errors: 0, Skipped: 0, Time elapsed: 0.072 sec <<<
FAILURE!
[INFO] Running web-testsuite.jsps
[INFO] Tests run: 4, Failures: 4, Errors: 0, Skipped: 0, Time elapsed: 0.08 sec <<<
FAILURE!
[INFO] Running web-testsuite.myfaces
[INFO] Tests run: 1, Failures: 1, Errors: 0, Skipped: 0, Time elapsed: 0.044 sec <<<
FAILURE!
--
[INFO] Running web-testsuite.security
[INFO] Tests run: 1, Failures: 1, Errors: 0, Skipped: 0, Time elapsed: 0.043 sec <<<
FAILURE!
[INFO] Running web-testsuite.references
[INFO] Tests run: 1, Failures: 1, Errors: 0, Skipped: 0, Time elapsed: 0.042 sec <<<
FAILURE!
[INFO] Running web-testsuite.servlets
[INFO] Tests run: 2, Failures: 2, Errors: 0, Skipped: 0, Time elapsed: 0.055 sec <<<
FAILURE!
 

Mime
View raw message