geronimo-dev mailing list archives

Site index · List index
Message view « Date » · « Thread »
Top « Date » · « Thread »
From pra...@apache.org
Subject [BUILD] 2.0: Failed for Revision: 596084
Date Sun, 18 Nov 2007 14:55:36 GMT
Geronimo Revision: 596084 built with tests included
 
See the full build-0900.log file at http://people.apache.org/~prasad/binaries/2.0/20071118/build-0900.log
 
Download the binaries from http://people.apache.org/~prasad/binaries/2.0/20071118
[INFO] BUILD SUCCESSFUL
[INFO] ------------------------------------------------------------------------
[INFO] Total time: 30 minutes 53 seconds
[INFO] Finished at: Sun Nov 18 09:34:01 EST 2007
[INFO] Final Memory: 200M/996M
[INFO] ------------------------------------------------------------------------
 
TESTSUITE RESULTS (Failures only)
=================================
See detailed results at http://people.apache.org/~prasad/testsuite/ResultsSummary.html
See the full test.log file at http://people.apache.org/~prasad/binaries/2.0/20071118/logs-0900/test.log
 
[INFO] Running console-testsuite.basic-console
[INFO] Tests run: 38, Failures: 38, Errors: 0, Skipped: 0, Time elapsed: 0.489 sec <<<
FAILURE!
[INFO] Running console-testsuite.advance-test
[INFO] Tests run: 12, Failures: 12, Errors: 0, Skipped: 0, Time elapsed: 0.22 sec <<<
FAILURE!
--
[INFO] Running corba-testsuite.corba-mytime
[INFO] Tests run: 1, Failures: 1, Errors: 0, Skipped: 0, Time elapsed: 0.045 sec <<<
FAILURE!
[INFO] Running deployment-testsuite.deployment
[INFO] Tests run: 2, Failures: 1, Errors: 0, Skipped: 0, Time elapsed: 0.049 sec <<<
FAILURE!
[INFO] Running deployment-testsuite.jca-cms
[INFO] Tests run: 2, Failures: 2, Errors: 0, Skipped: 0, Time elapsed: 0.065 sec <<<
FAILURE!
[INFO] Running enterprise-testsuite.jms
[INFO] Tests run: 1, Failures: 1, Errors: 0, Skipped: 0, Time elapsed: 0.041 sec <<<
FAILURE!
[INFO] Running jpa-testsuite.jpa
[INFO] Tests run: 1, Failures: 1, Errors: 0, Skipped: 0, Time elapsed: 0.047 sec <<<
FAILURE!
[INFO] Running sec-testsuite.security
[INFO] Tests run: 2, Failures: 2, Errors: 0, Skipped: 0, Time elapsed: 0.057 sec <<<
FAILURE!
[INFO] Running web-testsuite.jsps
[INFO] Tests run: 4, Failures: 4, Errors: 0, Skipped: 0, Time elapsed: 0.081 sec <<<
FAILURE!
[INFO] Running web-testsuite.myfaces
[INFO] Tests run: 1, Failures: 1, Errors: 0, Skipped: 0, Time elapsed: 0.049 sec <<<
FAILURE!
--
[INFO] Running web-testsuite.security
[INFO] Tests run: 1, Failures: 1, Errors: 0, Skipped: 0, Time elapsed: 0.046 sec <<<
FAILURE!
[INFO] Running web-testsuite.references
[INFO] Tests run: 1, Failures: 1, Errors: 0, Skipped: 0, Time elapsed: 0.049 sec <<<
FAILURE!
[INFO] Running web-testsuite.servlets
[INFO] Tests run: 2, Failures: 2, Errors: 0, Skipped: 0, Time elapsed: 0.07 sec <<<
FAILURE!
 

Mime
View raw message