geronimo-dev mailing list archives

Site index · List index
Message view « Date » · « Thread »
Top « Date » · « Thread »
From "Jacek Laskowski" <ja...@laskowski.net.pl>
Subject Re: [BUILD] 2.1: Failed for Revision: 592996
Date Thu, 08 Nov 2007 08:47:04 GMT
On 8 Nov 2007 03:21:12 -0000,  <prasad@apache.org> wrote:

> TESTSUITE RESULTS (Failures only)
> =================================
> See detailed results at http://people.apache.org/~prasad/testsuite/ResultsSummary.html
> See the full test.log file at http://people.apache.org/~prasad/binaries/trunk/20071107/logs-2100/test.log
>
> [INFO] Running console-testsuite.basic-console
> [INFO] Tests run: 110, Failures: 3, Errors: 0, Skipped: 107, Time elapsed: 0.872 sec
<<< FAILURE!
> [INFO] Running console-testsuite.advance-test
> [INFO] Tests run: 12, Failures: 12, Errors: 0, Skipped: 0, Time elapsed: 3.452 sec <<<
FAILURE!
> --
> [INFO] Running enterprise-testsuite.ejbtests
> [INFO] Tests run: 3, Failures: 3, Errors: 0, Skipped: 0, Time elapsed: 0.125 sec <<<
FAILURE!

How can I run the tests on my computer? I could build geronimo fine
yesterday with no failures.

Jacek

-- 
Jacek Laskowski
http://www.JacekLaskowski.pl

Mime
View raw message