geronimo-dev mailing list archives

Site index · List index
Message view « Date » · « Thread »
Top « Date » · « Thread »
From "Prasad Kashyap" <goyathlay.geron...@gmail.com>
Subject Re: [BUILD] 2.0: Successful
Date Sun, 07 Oct 2007 14:35:57 GMT
These test results are not accurate. The tests were hanging and
stepping into the next scheduled builds. I killed it.

Cheers
Prasad

On 7 Oct 2007 14:33:10 -0000, prasad@apache.org <prasad@apache.org> wrote:
> Geronimo Revision: 582613 built with tests included
>
> See the full build-0800.log file at http://people.apache.org/~prasad/binaries/2.0/20071007/build-0800.log
>
> Download the binaries from http://people.apache.org/~prasad/binaries/2.0/20071007
> [INFO] BUILD SUCCESSFUL
> [INFO] ------------------------------------------------------------------------
> [INFO] Total time: 23 minutes 48 seconds
> [INFO] Finished at: Sun Oct 07 08:28:38 EDT 2007
> [INFO] Final Memory: 203M/1005M
> [INFO] ------------------------------------------------------------------------
>
> TESTSUITE RESULTS (Failures only)
> =================================
> See detailed results at http://people.apache.org/~prasad/testsuite/ResultsSummary.html
> See the full test-0800.log file at http://people.apache.org/~prasad/binaries/2.0/20071007/test-0800.log
>
> [INFO] Running console-testsuite.basic-console
> [INFO] Tests run: 38, Failures: 38, Errors: 0, Skipped: 0, Time elapsed: 1,142.247 sec
<<< FAILURE!
> --
> [INFO] Running console-testsuite.advance-test
> [INFO] Tests run: 12, Failures: 12, Errors: 0, Skipped: 0, Time elapsed: 361.532 sec
<<< FAILURE!
> --
> [INFO] Running corba-testsuite.corba-mytime
> [INFO] Tests run: 1, Failures: 1, Errors: 0, Skipped: 0, Time elapsed: 30.132 sec <<<
FAILURE!
> --
> [INFO] Running deployment-testsuite.deployment
> [INFO] Tests run: 2, Failures: 1, Errors: 0, Skipped: 0, Time elapsed: 30.138 sec <<<
FAILURE!
> --
> [INFO] Running deployment-testsuite.jca-cms
> [INFO] Tests run: 2, Failures: 2, Errors: 0, Skipped: 0, Time elapsed: 60.193 sec <<<
FAILURE!
> --
> [INFO] Running enterprise-testsuite.jms
> [INFO] Tests run: 1, Failures: 1, Errors: 0, Skipped: 0, Time elapsed: 30.1 sec <<<
FAILURE!
> --
> [INFO] Running jpa-testsuite.jpa
> [INFO] Tests run: 1, Failures: 1, Errors: 0, Skipped: 0, Time elapsed: 30.083 sec <<<
FAILURE!
> --
> [INFO] Running sec-testsuite.security
> [INFO] Tests run: 2, Failures: 2, Errors: 0, Skipped: 0, Time elapsed: 60.213 sec <<<
FAILURE!
> --
> [INFO] Running web-testsuite.jsps
> [INFO] Tests run: 4, Failures: 4, Errors: 0, Skipped: 0, Time elapsed: 120.233 sec <<<
FAILURE!
> --
> [INFO] Running web-testsuite.myfaces
> [INFO] Tests run: 1, Failures: 1, Errors: 0, Skipped: 0, Time elapsed: 30.142 sec <<<
FAILURE!
> --
> [INFO] Running web-testsuite.security
> [INFO] Tests run: 1, Failures: 1, Errors: 0, Skipped: 0, Time elapsed: 30.151 sec <<<
FAILURE!
> --
> [INFO] Running web-testsuite.references
> [INFO] Tests run: 1, Failures: 1, Errors: 0, Skipped: 0, Time elapsed: 30.112 sec <<<
FAILURE!
> --
> [INFO] Running web-testsuite.servlets
> [INFO] Tests run: 2, Failures: 2, Errors: 0, Skipped: 0, Time elapsed: 60.202 sec <<<
FAILURE!
> --
> [INFO] Running web-testsuite.jetty
> [INFO] Tests run: 2, Failures: 2, Errors: 0, Skipped: 0, Time elapsed: 60.086 sec <<<
FAILURE!
> --
> [INFO] Running org.apache.geronimo.testsuite.testset.JaxWSTest
> [INFO] Tests run: 5, Failures: 5, Errors: 0, Skipped: 0, Time elapsed: 2,000.201 sec
<<< FAILURE!
> --
> [INFO]  ... 27 more
> [INFO] Tests run: 1, Failures: 1, Errors: 0, Skipped: 0, Time elapsed: 0.321 sec <<<
FAILURE!
> --
> [INFO] Hello foo bar
> [INFO] Tests run: 3, Failures: 2, Errors: 0, Skipped: 0, Time elapsed: 800.884 sec <<<
FAILURE!
> --
> [INFO] Running org.apache.geronimo.testsuite.testset.WebJAXRTest
> [INFO] Tests run: 2, Failures: 2, Errors: 0, Skipped: 0, Time elapsed: 800.172 sec <<<
FAILURE!
> --
> [INFO] Running org.apache.geronimo.testsuite.testset.WebStaxTest
> [INFO] Tests run: 2, Failures: 2, Errors: 0, Skipped: 0, Time elapsed: 800.181 sec <<<
FAILURE!
>
>

Mime
View raw message