geronimo-dev mailing list archives

Site index · List index
Message view « Date » · « Thread »
Top « Date » · « Thread »
From pra...@apache.org
Subject [BUILD] 2.0: Failed for Revision: 583351
Date Wed, 10 Oct 2007 05:08:27 GMT
Geronimo Revision: 583351 built with tests included
 
See the full build-0000.log file at http://people.apache.org/~prasad/binaries/2.0/20071010/build-0000.log
 
Download the binaries from http://people.apache.org/~prasad/binaries/2.0/20071010
[INFO] BUILD SUCCESSFUL
[INFO] ------------------------------------------------------------------------
[INFO] Total time: 12 minutes 30 seconds
[INFO] Finished at: Wed Oct 10 00:37:18 EDT 2007
[INFO] Final Memory: 188M/980M
[INFO] ------------------------------------------------------------------------
 
TESTSUITE RESULTS (Failures only)
=================================
See detailed results at http://people.apache.org/~prasad/testsuite/ResultsSummary.html
See the full test-0000.log file at http://people.apache.org/~prasad/binaries/2.0/20071010/test-0000.log
 
[INFO] Running web-testsuite.jetty
[INFO] Tests run: 2, Failures: 1, Errors: 0, Skipped: 0, Time elapsed: 0.073 sec <<<
FAILURE!
--
[INFO] Running org.apache.geronimo.testsuite.testset.JaxWSTest
[INFO] Tests run: 3, Failures: 3, Errors: 0, Skipped: 0, Time elapsed: 14.531 sec <<<
FAILURE!
[INFO] Running org.apache.geronimo.testsuite.testset.WebJAXRTest
[INFO] Tests run: 2, Failures: 2, Errors: 0, Skipped: 0, Time elapsed: 0.179 sec <<<
FAILURE!
[INFO] Running org.apache.geronimo.testsuite.testset.EJBJAXRTest
[INFO] Tests run: 1, Failures: 1, Errors: 0, Skipped: 0, Time elapsed: 4.184 sec <<<
FAILURE!
 

Mime
View raw message