geronimo-dev mailing list archives

Site index · List index
Message view « Date » · « Thread »
Top « Date » · « Thread »
From Anita Kulshreshtha <a_kuls...@yahoo.com>
Subject Re: Build problem on Trunk
Date Mon, 17 Sep 2007 19:17:00 GMT
   This is the error I got from today's trunk on win xp and  java
1.5.0_08-b03 - 

[INFO] [compiler:testCompile]
Compiling 16 source files to
C:\anita\geronimo\g2.0\modules\geronimo-system\targ
et\test-classes
[INFO]
------------------------------------------------------------------------
[ERROR] BUILD FAILURE
[INFO]
------------------------------------------------------------------------
[INFO] Compilation failure

C:\anita\geronimo\g2.0\modules\geronimo-system\src\test\java\org\apache\geronimo
\system\plugin\CopyConfigTest.java:[258,69] incompatible types
found   : java.util.List<java.io.Serializable>
required: java.util.List<java.lang.Object>

Thanks
Anita

--- Vamsavardhana Reddy <c1vamsi1c@gmail.com> wrote:

> I guess I am the only one for now hitting this build error.  Anyone
> else
> seeing this error?  Output from command window posted below..
> 
> I am using Sun JDK 1.5.0_12 on WinXP SP2.
> 
> 
> [INFO]
>
-------------------------------------------------------------------------
> ---
> [INFO] Building Geronimo :: Deploy :: JSR-88
> [INFO]    task-segment: [install]
> [INFO]
>
-------------------------------------------------------------------------
> ---
> [INFO] [enforcer:enforce {execution: default}]
> [INFO] [tools:copy-legal-files {execution: install-legal-files}]
> [INFO] [resources:resources]
> [INFO] Using default encoding to copy filtered resources.
> [INFO] [compiler:compile]
> [INFO] Compiling 25 source files to
> C:\G\server\trunk\modules\geronimo-deploy-js
> r88\target\classes
> [INFO]
>
------------------------------------------------------------------------
> [ERROR] BUILD FAILURE
> [INFO]
>
------------------------------------------------------------------------
> [INFO] Compilation failure
> Failure executing javac, but could not parse the error:
> An exception has occurred in the compiler (1.5.0_12). Please file a
> bug at
> the J
> ava Developer Connection (http://java.sun.com/webapps/bugreport) 
> after
> checking
>  the Bug Parade for duplicates. Include your program and the
> following
> diagnosti
> c in your report.  Thank you.
> com.sun.tools.javac.code.Symbol$CompletionFailure: file
> javax\xml\bind\annotatio
> n\XmlAccessorType.class not found
> 
> 
> 
> Failure executing javac, but could not parse the error:
> An exception has occurred in the compiler (1.5.0_12). Please file a
> bug at
> the J
> ava Developer Connection (http://java.sun.com/webapps/bugreport) 
> after
> checking
>  the Bug Parade for duplicates. Include your program and the
> following
> diagnosti
> c in your report.  Thank you.
> com.sun.tools.javac.code.Symbol$CompletionFailure: file
> javax\xml\bind\annotatio
> n\XmlAccessorType.class not found
> 
> 
> [INFO]
>
------------------------------------------------------------------------
> [INFO] For more information, run Maven with the -e switch
> [INFO]
>
------------------------------------------------------------------------
> [INFO] Total time: 4 minutes 9 seconds
> [INFO] Finished at: Mon Sep 17 22:57:49 IST 2007
> [INFO] Final Memory: 97M/174M
> [INFO]
>
------------------------------------------------------------------------
> 



       
____________________________________________________________________________________
Moody friends. Drama queens. Your life? Nope! - their life, your story. Play Sims Stories
at Yahoo! Games.
http://sims.yahoo.com/  

Mime
View raw message