geronimo-dev mailing list archives

Site index · List index
Message view « Date » · « Thread »
Top « Date » · « Thread »
From "Jarek Gawor" <jga...@gmail.com>
Subject Re: [BUILD] 2.0: Successful
Date Sat, 29 Sep 2007 03:04:46 GMT
Does anybody have any ideas about the following error (sometimes it
works fine, sometimes fails like that):

[INFO] Building Geronimo TestSuite :: Web-tier Testsuite
[INFO]    task-segment: [install]
[INFO] ----------------------------------------------------------------------------
[INFO] [enforcer:enforce {execution: default}]
[INFO] [tools:copy-legal-files {execution: install-legal-files}]
[INFO] [selenium:xvfb {execution: xvfb}]
[INFO] Starting Xvfb...
[INFO] Using display: :23
[INFO] Using Xauthority file: /tmp/Xvfb44522.Xauthority
[INFO] Deleting: /tmp/Xvfb44522.Xauthority
[WARNING] /usr/X11R6/bin/xauth:  creating new authority file
/tmp/Xvfb44522.Xauthority
[WARNING] /usr/X11R6/bin/xauth: (argv):1:  key contains odd number of
or non-hex characters
[INFO] ------------------------------------------------------------------------
[ERROR] FATAL ERROR
[INFO] ------------------------------------------------------------------------
[INFO] exec returned: 1
[INFO] ------------------------------------------------------------------------
[INFO] Trace
: exec returned: 1
	at org.apache.tools.ant.taskdefs.ExecTask.runExecute(ExecTask.java:636)
	at org.apache.tools.ant.taskdefs.ExecTask.runExec(ExecTask.java:662)
	at org.apache.tools.ant.taskdefs.ExecTask.execute(ExecTask.java:487)
	at sun.reflect.NativeMethodAccessorImpl.invoke0(Native Method)
	at sun.reflect.NativeMethodAccessorImpl.invoke(NativeMethodAccessorImpl.java:39)
	at sun.reflect.DelegatingMethodAccessorImpl.invoke(DelegatingMethodAccessorImpl.java:25)
	at java.lang.reflect.Method.invoke(Method.java:585)
	at org.apache.tools.ant.dispatch.DispatchUtils.execute(DispatchUtils.java:105)
	at org.apache.tools.ant.Task.perform(Task.java:348)
	at groovy.util.AntBuilder.nodeCompleted(AntBuilder.java:171)
	at groovy.util.BuilderSupport.doInvokeMethod(BuilderSupport.java:154)
	at groovy.util.AntBuilder.doInvokeMethod(AntBuilder.java:132)
	at groovy.util.BuilderSupport.invokeMethod(BuilderSupport.java:65)
	at org.codehaus.groovy.runtime.Invoker.invokePogoMethod(Invoker.java:119)
	at org.codehaus.groovy.runtime.Invoker.invokeMethod(Invoker.java:81)
	at org.codehaus.groovy.runtime.InvokerHelper.invokeMethod(InvokerHelper.java:85)
	at org.codehaus.groovy.runtime.ScriptBytecodeAdapter.invokeMethodN(ScriptBytecodeAdapter.java:158)
	at org.codehaus.mojo.selenium.XvfbMojo.setupXauthority(XvfbMojo.groovy:270)
	at org.codehaus.mojo.selenium.XvfbMojo.this$4$setupXauthority(XvfbMojo.groovy)
	at sun.reflect.NativeMethodAccessorImpl.invoke0(Native Method)
	at sun.reflect.NativeMethodAccessorImpl.invoke(NativeMethodAccessorImpl.java:39)
	at sun.reflect.DelegatingMethodAccessorImpl.invoke(DelegatingMethodAccessorImpl.java:25)
	at java.lang.reflect.Method.invoke(Method.java:585)
	at org.codehaus.groovy.runtime.metaclass.ReflectionMetaMethod.invoke(ReflectionMetaMethod.java:52)
	at org.codehaus.groovy.runtime.MetaClassHelper.doMethodInvoke(MetaClassHelper.java:714)
	at groovy.lang.MetaClassImpl.invokeMethod(MetaClassImpl.java:583)
	at org.codehaus.groovy.runtime.ScriptBytecodeAdapter.invokeMethodOnCurrentN(ScriptBytecodeAdapter.java:66)
	at org.codehaus.groovy.runtime.ScriptBytecodeAdapter.invokeMethodOnCurrent0(ScriptBytecodeAdapter.java:99)
	at org.codehaus.mojo.selenium.XvfbMojo.execute(XvfbMojo.groovy:165)
	at org.apache.maven.plugin.DefaultPluginManager.executeMojo(DefaultPluginManager.java:420)
	at org.apache.maven.lifecycle.DefaultLifecycleExecutor.executeGoals(DefaultLifecycleExecutor.java:539)
	at org.apache.maven.lifecycle.DefaultLifecycleExecutor.executeGoalWithLifecycle(DefaultLifecycleExecutor.java:480)
	at org.apache.maven.lifecycle.DefaultLifecycleExecutor.executeGoal(DefaultLifecycleExecutor.java:459)
	at org.apache.maven.lifecycle.DefaultLifecycleExecutor.executeGoalAndHandleFailures(DefaultLifecycleExecutor.java:311)
	at org.apache.maven.lifecycle.DefaultLifecycleExecutor.executeTaskSegments(DefaultLifecycleExecutor.java:278)
	at org.apache.maven.lifecycle.DefaultLifecycleExecutor.execute(DefaultLifecycleExecutor.java:143)
	at org.apache.maven.DefaultMaven.doExecute(DefaultMaven.java:330)
	at org.apache.maven.DefaultMaven.execute(DefaultMaven.java:123)
	at org.apache.maven.cli.MavenCli.main(MavenCli.java:272)
	at sun.reflect.NativeMethodAccessorImpl.invoke0(Native Method)
	at sun.reflect.NativeMethodAccessorImpl.invoke(NativeMethodAccessorImpl.java:39)
	at sun.reflect.DelegatingMethodAccessorImpl.invoke(DelegatingMethodAccessorImpl.java:25)
	at java.lang.reflect.Method.invoke(Method.java:585)
	at org.codehaus.classworlds.Launcher.launchEnhanced(Launcher.java:315)
	at org.codehaus.classworlds.Launcher.launch(Launcher.java:255)
	at org.codehaus.classworlds.Launcher.mainWithExitCode(Launcher.java:430)
	at org.codehaus.classworlds.Launcher.main(Launcher.java:375)
[INFO] ------------------------------------------------------------------------
[INFO] Total time: 16 minutes 37 seconds
[INFO] Finished at: Fri Sep 28 22:51:17 EDT 2007
[INFO] Final Memory: 27M/559M
[INFO] ------------------------------------------------------------------------

On 29 Sep 2007 02:48:06 -0000, prasad@apache.org <prasad@apache.org> wrote:
> OpenEJB trunk at 580523
> Geronimo Revision: 580530 built with tests included
>
> See the full build-2200.log file at http://people.apache.org/~prasad/binaries/2.0/20070928/build-2200.log
>
> Download the binaries from http://people.apache.org/~prasad/binaries/2.0/20070928
> [INFO] BUILD SUCCESSFUL
> [INFO] ------------------------------------------------------------------------
> [INFO] Total time: 25 minutes 36 seconds
> [INFO] Finished at: Fri Sep 28 22:31:05 EDT 2007
> [INFO] Final Memory: 189M/1005M
> [INFO] ------------------------------------------------------------------------
>
> TESTSUITE RESULTS (Failures only)
> =================================
> See detailed results at http://people.apache.org/~prasad/testsuite/ResultsSummary.html
> See the full test-2200.log file at http://people.apache.org/~prasad/binaries/2.0/20070928/test-2200.log
>
> [INFO] Running corba-testsuite.corba-mytime
> [INFO] Tests run: 1, Failures: 1, Errors: 0, Skipped: 0, Time elapsed: 7.107 sec <<<
FAILURE!
> --
> [INFO] Running deployment-testsuite.jca-cms
> [INFO] Tests run: 1, Failures: 1, Errors: 0, Skipped: 0, Time elapsed: 0.327 sec <<<
FAILURE!
>
>

Mime
View raw message