geronimo-dev mailing list archives

Site index · List index
Message view « Date » · « Thread »
Top « Date » · « Thread »
From pra...@apache.org
Subject [BUILD] 2.0: Failed for Revision: 566529
Date Thu, 16 Aug 2007 08:09:11 GMT
OpenEJB trunk at 566527
Geronimo Revision: 566529 built with tests included
 
See the full build-0400.log file at http://people.apache.org/~prasad/binaries/20070816/build-0400.log
 
[WARNING] Unable to get resource 'org.apache.geronimo.components:geronimo-transaction:pom:2.0.1'
from repository apache-incubator (http://people.apache.org/repo/m2-incubating-repository/)
Downloading: http://repo1.maven.org/maven2/org/apache/geronimo/components/geronimo-transaction/2.0.1/geronimo-transaction-2.0.1.pom
2K downloaded
Downloading: http://download.java.net/maven/1//org.apache.geronimo.components/poms/geronimo-txmanager-parent-2.0.1.pom
[WARNING] Unable to get resource 'org.apache.geronimo.components:geronimo-txmanager-parent:pom:2.0.1'
from repository java.net (http://download.java.net/maven/1/)
Downloading: http://people.apache.org/repo/m2-incubating-repository//org/apache/geronimo/components/geronimo-txmanager-parent/2.0.1/geronimo-txmanager-parent-2.0.1.pom
[WARNING] Unable to get resource 'org.apache.geronimo.components:geronimo-txmanager-parent:pom:2.0.1'
from repository apache-incubator (http://people.apache.org/repo/m2-incubating-repository/)
Downloading: http://repo1.maven.org/maven2/org/apache/geronimo/components/geronimo-txmanager-parent/2.0.1/geronimo-txmanager-parent-2.0.1.pom
8K downloaded
Downloading: http://download.java.net/maven/1//org.apache.geronimo.components/jars/geronimo-transaction-2.0.1.jar
[WARNING] Unable to get resource 'org.apache.geronimo.components:geronimo-transaction:jar:2.0.1'
from repository java.net (http://download.java.net/maven/1/)
Downloading: http://people.apache.org/repo/m2-incubating-repository//org/apache/geronimo/components/geronimo-transaction/2.0.1/geronimo-transaction-2.0.1.jar
[WARNING] Unable to get resource 'org.apache.geronimo.components:geronimo-transaction:jar:2.0.1'
from repository apache-incubator (http://people.apache.org/repo/m2-incubating-repository/)
Downloading: http://repo1.maven.org/maven2/org/apache/geronimo/components/geronimo-transaction/2.0.1/geronimo-transaction-2.0.1.jar
49K downloaded
Downloading: http://download.java.net/maven/1//org.objectweb.howl/jars/howl-1.0.1-1.jar
[WARNING] Unable to get resource 'org.objectweb.howl:howl:jar:1.0.1-1' from repository java.net
(http://download.java.net/maven/1/)
Downloading: http://people.apache.org/repo/m2-incubating-repository//org/objectweb/howl/howl/1.0.1-1/howl-1.0.1-1.jar
[WARNING] Unable to get resource 'org.objectweb.howl:howl:jar:1.0.1-1' from repository apache-incubator
(http://people.apache.org/repo/m2-incubating-repository/)
Downloading: http://repo1.maven.org/maven2/org/objectweb/howl/howl/1.0.1-1/howl-1.0.1-1.jar
78K downloaded
[INFO] [compiler:compile]
[INFO] Compiling 4 source files to /home/prasad/geronimo/2.0/modules/geronimo-transaction/target/classes
[INFO] [resources:testResources]
[INFO] Using default encoding to copy filtered resources.
[INFO] [compiler:testCompile]
[INFO] Nothing to compile - all classes are up to date
[INFO] [surefire:test]
[INFO] No tests to run.
[INFO] [jar:jar]
[INFO] Building jar: /home/prasad/geronimo/2.0/modules/geronimo-transaction/target/geronimo-transaction-2.0.2-SNAPSHOT.jar
[INFO] [tools:verify-legal-files {execution: verify-legal-files}]
[INFO] Checking legal files in: geronimo-transaction-2.0.2-SNAPSHOT.jar
[INFO] [install:install]
[INFO] Installing /home/prasad/geronimo/2.0/modules/geronimo-transaction/target/geronimo-transaction-2.0.2-SNAPSHOT.jar
to /home/prasad/.m2/repository/org/apache/geronimo/modules/geronimo-transaction/2.0.2-SNAPSHOT/geronimo-transaction-2.0.2-SNAPSHOT.jar
[INFO] ----------------------------------------------------------------------------
[INFO] Building Geronimo :: Naming
[INFO]    task-segment: [install]
[INFO] ----------------------------------------------------------------------------
[INFO] [enforcer:enforce {execution: default}]
[INFO] [tools:copy-legal-files {execution: install-legal-files}]
[INFO] Created dir: /home/prasad/geronimo/2.0/modules/geronimo-naming/target/classes/META-INF
[INFO] Copying 2 files to /home/prasad/geronimo/2.0/modules/geronimo-naming/target/classes/META-INF
[INFO] [resources:resources]
[INFO] Using default encoding to copy filtered resources.
Downloading: http://download.java.net/maven/1//org.apache.xbean/poms/xbean-naming-3.0.1.pom
[WARNING] Unable to get resource 'org.apache.xbean:xbean-naming:pom:3.0.1' from repository
java.net (http://download.java.net/maven/1/)
Downloading: http://people.apache.org/repo/m2-incubating-repository//org/apache/xbean/xbean-naming/3.0.1/xbean-naming-3.0.1.pom
[WARNING] Unable to get resource 'org.apache.xbean:xbean-naming:pom:3.0.1' from repository
apache-incubator (http://people.apache.org/repo/m2-incubating-repository/)
Downloading: http://repo1.maven.org/maven2/org/apache/xbean/xbean-naming/3.0.1/xbean-naming-3.0.1.pom
1K downloaded
Downloading: http://download.java.net/maven/1//org.apache.xbean/poms/xbean-3.0.1.pom
[WARNING] Unable to get resource 'org.apache.xbean:xbean:pom:3.0.1' from repository java.net
(http://download.java.net/maven/1/)
Downloading: http://people.apache.org/repo/m2-incubating-repository//org/apache/xbean/xbean/3.0.1/xbean-3.0.1.pom
[WARNING] Unable to get resource 'org.apache.xbean:xbean:pom:3.0.1' from repository apache-incubator
(http://people.apache.org/repo/m2-incubating-repository/)
Downloading: http://repo1.maven.org/maven2/org/apache/xbean/xbean/3.0.1/xbean-3.0.1.pom
17K downloaded
Downloading: http://download.java.net/maven/1//org.apache.xbean/jars/xbean-naming-3.0.1.jar
[WARNING] Unable to get resource 'org.apache.xbean:xbean-naming:jar:3.0.1' from repository
java.net (http://download.java.net/maven/1/)
Downloading: http://people.apache.org/repo/m2-incubating-repository//org/apache/xbean/xbean-naming/3.0.1/xbean-naming-3.0.1.jar
[WARNING] Unable to get resource 'org.apache.xbean:xbean-naming:jar:3.0.1' from repository
apache-incubator (http://people.apache.org/repo/m2-incubating-repository/)
Downloading: http://repo1.maven.org/maven2/org/apache/xbean/xbean-naming/3.0.1/xbean-naming-3.0.1.jar
47K downloaded
[INFO] [compiler:compile]
[INFO] Compiling 21 source files to /home/prasad/geronimo/2.0/modules/geronimo-naming/target/classes
[INFO] [resources:testResources]
[INFO] Using default encoding to copy filtered resources.
[INFO] [compiler:testCompile]
[INFO] Compiling 6 source files to /home/prasad/geronimo/2.0/modules/geronimo-naming/target/test-classes
[INFO] [surefire:test]
[INFO] Surefire report directory: /home/prasad/geronimo/2.0/modules/geronimo-naming/target/surefire-reports

-------------------------------------------------------
 T E S T S
-------------------------------------------------------
Running org.apache.geronimo.gjndi.binding.GBeanBindingTest
04:16:16,162 ERROR [ConfigurationUtil] Cound not determine the installation directory of Apache
Geronimo, because the startup jar could not be found in the current class loader.
Tests run: 1, Failures: 1, Errors: 0, Skipped: 0, Time elapsed: 1.319 sec <<< FAILURE!
Running org.apache.geronimo.gjndi.KernelContextGBeanTest
Tests run: 1, Failures: 0, Errors: 0, Skipped: 0, Time elapsed: 1.988 sec
Running org.apache.geronimo.gjndi.JavaCompGBeanTest
Tests run: 1, Failures: 0, Errors: 0, Skipped: 0, Time elapsed: 0.324 sec
Running org.apache.geronimo.gjndi.JavaCompContextTest
lookup(String) milliseconds: 692
Tests run: 8, Failures: 0, Errors: 0, Skipped: 0, Time elapsed: 0.718 sec

Results :
Tests run: 11, Failures: 1, Errors: 0, Skipped: 0

[INFO] ------------------------------------------------------------------------
[ERROR] BUILD FAILURE
[INFO] ------------------------------------------------------------------------
[INFO] There are test failures.
[INFO] ------------------------------------------------------------------------
[INFO] For more information, run Maven with the -e switch
[INFO] ------------------------------------------------------------------------
[INFO] Total time: 3 minutes 8 seconds
[INFO] Finished at: Thu Aug 16 04:16:20 EDT 2007
[INFO] Final Memory: 73M/553M
[INFO] ------------------------------------------------------------------------

Mime
View raw message