geronimo-dev mailing list archives

Site index · List index
Message view « Date » · « Thread »
Top « Date » · « Thread »
From pra...@apache.org
Subject [BUILD] TRUNK: Failed for Revision: 539956
Date Sun, 20 May 2007 22:01:33 GMT
OpenEJB trunk at 539954
Geronimo Revision: 539956 built with tests skipped
 
See the full build-1800.log file at http://people.apache.org/~prasad/binaries/20070520/build-1800.log
 
[INFO] Using default encoding to copy filtered resources.
[INFO] [compiler:testCompile]
[INFO] Not compiling test sources
[INFO] [surefire:test]
[INFO] Tests are skipped.
[INFO] [jar:jar]
[INFO] Building jar: /home/prasad/geronimo/trunk/modules/geronimo-j2ee/target/geronimo-j2ee-2.0-SNAPSHOT.jar
[INFO] [tools:verify-legal-files {execution: verify-legal-files}]
[INFO] Checking legal files in: geronimo-j2ee-2.0-SNAPSHOT.jar
[INFO] [install:install]
[INFO] Installing /home/prasad/geronimo/trunk/modules/geronimo-j2ee/target/geronimo-j2ee-2.0-SNAPSHOT.jar
to /home/prasad/.m2/repository/org/apache/geronimo/modules/geronimo-j2ee/2.0-SNAPSHOT/geronimo-j2ee-2.0-SNAPSHOT.jar
[INFO] ----------------------------------------------------------------------------
[INFO] Building Geronimo :: Core
[INFO]    task-segment: [install]
[INFO] ----------------------------------------------------------------------------
[INFO] [enforcer:enforce {execution: default}]
[INFO] [tools:copy-legal-files {execution: install-legal-files}]
[INFO] Created dir: /home/prasad/geronimo/trunk/modules/geronimo-core/target/classes/META-INF
[INFO] Copying 2 files to /home/prasad/geronimo/trunk/modules/geronimo-core/target/classes/META-INF
[INFO] [resources:resources]
[INFO] Using default encoding to copy filtered resources.
[INFO] [compiler:compile]
[INFO] Compiling 8 source files to /home/prasad/geronimo/trunk/modules/geronimo-core/target/classes
[INFO] [resources:testResources]
[INFO] Using default encoding to copy filtered resources.
[INFO] [compiler:testCompile]
[INFO] Not compiling test sources
[INFO] [surefire:test]
[INFO] Tests are skipped.
[INFO] [jar:jar]
[INFO] Building jar: /home/prasad/geronimo/trunk/modules/geronimo-core/target/geronimo-core-2.0-SNAPSHOT.jar
[INFO] [tools:verify-legal-files {execution: verify-legal-files}]
[INFO] Checking legal files in: geronimo-core-2.0-SNAPSHOT.jar
[INFO] [install:install]
[INFO] Installing /home/prasad/geronimo/trunk/modules/geronimo-core/target/geronimo-core-2.0-SNAPSHOT.jar
to /home/prasad/.m2/repository/org/apache/geronimo/modules/geronimo-core/2.0-SNAPSHOT/geronimo-core-2.0-SNAPSHOT.jar
[INFO] ----------------------------------------------------------------------------
[INFO] Building Geronimo :: Security
[INFO]    task-segment: [install]
[INFO] ----------------------------------------------------------------------------
[INFO] [enforcer:enforce {execution: default}]
[INFO] [tools:copy-legal-files {execution: install-legal-files}]
[INFO] Created dir: /home/prasad/geronimo/trunk/modules/geronimo-security/target/classes/META-INF
[INFO] Copying 2 files to /home/prasad/geronimo/trunk/modules/geronimo-security/target/classes/META-INF
[INFO] [resources:resources]
[INFO] Using default encoding to copy filtered resources.
[INFO] snapshot org.apache.geronimo.specs:geronimo-jacc_1.1_spec:1.0-SNAPSHOT: checking for
updates from apache-snapshots
[INFO] snapshot org.apache.geronimo.specs:geronimo-jacc_1.1_spec:1.0-SNAPSHOT: checking for
updates from codehaus-snapshots
[INFO] snapshot org.apache.geronimo.specs:geronimo-jacc_1.1_spec:1.0-SNAPSHOT: checking for
updates from apache.snapshots
Downloading: http://people.apache.org/repo/m2-snapshot-repository/org/apache/geronimo/specs/geronimo-jacc_1.1_spec/1.0-SNAPSHOT/geronimo-jacc_1.1_spec-1.0-20070125.200733-4.pom
1K downloaded
Downloading: http://tomcat.apache.org/dev/dist/m2-repository/activeio/activeio/2.0-r118/activeio-2.0-r118.pom
[WARNING] Unable to get resource 'activeio:activeio:pom:2.0-r118' from repository tomcat-m2-repo
(http://tomcat.apache.org/dev/dist/m2-repository)
Downloading: http://people.apache.org/repo/m2-incubating-repository//activeio/activeio/2.0-r118/activeio-2.0-r118.pom
[WARNING] Unable to get resource 'activeio:activeio:pom:2.0-r118' from repository apache-incubator
(http://people.apache.org/repo/m2-incubating-repository/)
Downloading: http://repo1.maven.org/maven2/activeio/activeio/2.0-r118/activeio-2.0-r118.pom
153b downloaded
[WARNING] *** CHECKSUM FAILED - Checksum failed on download: local = '68e53e67dfe155657bc2fd63ef822539c68d8b3e';
remote = '021a98e9c1d341ff45f2385d0e4c073104240f64' - RETRYING
Downloading: http://repo1.maven.org/maven2/activeio/activeio/2.0-r118/activeio-2.0-r118.pom
153b downloaded
[WARNING] *** CHECKSUM FAILED - Checksum failed on download: local = '68e53e67dfe155657bc2fd63ef822539c68d8b3e';
remote = '021a98e9c1d341ff45f2385d0e4c073104240f64' - IGNORING
Downloading: http://tomcat.apache.org/dev/dist/m2-repository/concurrent/concurrent/1.3.4/concurrent-1.3.4.pom
[WARNING] Unable to get resource 'concurrent:concurrent:pom:1.3.4' from repository tomcat-m2-repo
(http://tomcat.apache.org/dev/dist/m2-repository)
Downloading: http://people.apache.org/repo/m2-incubating-repository//concurrent/concurrent/1.3.4/concurrent-1.3.4.pom
[WARNING] Unable to get resource 'concurrent:concurrent:pom:1.3.4' from repository apache-incubator
(http://people.apache.org/repo/m2-incubating-repository/)
Downloading: http://repo1.maven.org/maven2/concurrent/concurrent/1.3.4/concurrent-1.3.4.pom
1K downloaded
Downloading: http://tomcat.apache.org/dev/dist/m2-repository/hsqldb/hsqldb/1.7.2.2/hsqldb-1.7.2.2.pom
[WARNING] Unable to get resource 'hsqldb:hsqldb:pom:1.7.2.2' from repository tomcat-m2-repo
(http://tomcat.apache.org/dev/dist/m2-repository)
Downloading: http://people.apache.org/repo/m2-incubating-repository//hsqldb/hsqldb/1.7.2.2/hsqldb-1.7.2.2.pom
[WARNING] Unable to get resource 'hsqldb:hsqldb:pom:1.7.2.2' from repository apache-incubator
(http://people.apache.org/repo/m2-incubating-repository/)
Downloading: http://repo1.maven.org/maven2/hsqldb/hsqldb/1.7.2.2/hsqldb-1.7.2.2.pom
149b downloaded
Downloading: http://tomcat.apache.org/dev/dist/m2-repository/activeio/activeio/2.0-r118/activeio-2.0-r118.jar
[WARNING] Unable to get resource 'activeio:activeio:jar:2.0-r118' from repository tomcat-m2-repo
(http://tomcat.apache.org/dev/dist/m2-repository)
Downloading: http://people.apache.org/repo/m2-incubating-repository//activeio/activeio/2.0-r118/activeio-2.0-r118.jar
[WARNING] Unable to get resource 'activeio:activeio:jar:2.0-r118' from repository apache-incubator
(http://people.apache.org/repo/m2-incubating-repository/)
Downloading: http://repo1.maven.org/maven2/activeio/activeio/2.0-r118/activeio-2.0-r118.jar
233K downloaded
Downloading: http://people.apache.org/repo/m2-snapshot-repository/org/apache/geronimo/specs/geronimo-jacc_1.1_spec/1.0-SNAPSHOT/geronimo-jacc_1.1_spec-1.0-20070125.200733-4.jar
32K downloaded
[INFO] [compiler:compile]
[INFO] Compiling 107 source files to /home/prasad/geronimo/trunk/modules/geronimo-security/target/classes
[INFO] ------------------------------------------------------------------------
[ERROR] BUILD FAILURE
[INFO] ------------------------------------------------------------------------
[INFO] Compilation failure
/home/prasad/geronimo/trunk/modules/geronimo-security/src/main/java/org/apache/geronimo/security/realm/providers/SQLLoginModule.java:[193,73]
unreported exception java.lang.Exception; must be caught or declared to be thrown



/home/prasad/geronimo/trunk/modules/geronimo-security/src/main/java/org/apache/geronimo/security/realm/providers/SQLLoginModule.java:[193,73]
unreported exception java.lang.Exception; must be caught or declared to be thrown


[INFO] ------------------------------------------------------------------------
[INFO] For more information, run Maven with the -e switch
[INFO] ------------------------------------------------------------------------
[INFO] Total time: 1 minute 59 seconds
[INFO] Finished at: Sun May 20 18:12:24 EDT 2007
[INFO] Final Memory: 77M/556M
[INFO] ------------------------------------------------------------------------

Mime
View raw message