geronimo-dev mailing list archives

Site index · List index
Message view « Date » · « Thread »
Top « Date » · « Thread »
From Anita Kulshreshtha <a_kuls...@yahoo.com>
Subject strange build error
Date Sun, 27 May 2007 12:20:16 GMT
  I am seeing this error on SUSE 9.2... The build on Win XP works fine.
Has any one used SUSE 9.2? 

Thanks
Anita

-------------------------------------------------------
 T E S T S
-------------------------------------------------------
Running org.apache.geronimo.mavenplugins.car.PlanProcessorMojoTest
Tests run: 2, Failures: 0, Errors: 2, Skipped: 0, Time elapsed: 0.521
sec <<< FAILURE!

Results :
Tests run: 2, Failures: 0, Errors: 2, Skipped: 0

[INFO]
------------------------------------------------------------------------
[ERROR] BUILD FAILURE
[INFO]
------------------------------------------------------------------------
[INFO] There are test failures.
[INFO]
------------------------------------------------------------------------
[INFO] Trace
org.apache.maven.BuildFailureException: There are test failures.
        at
org.apache.maven.lifecycle.DefaultLifecycleExecutor.executeGoals(DefaultLifecycleExecutor.java:560)
        at
org.apache.maven.lifecycle.DefaultLifecycleExecutor.executeGoalWithLifecycle(DefaultLifecycleExecutor.java:480)
        at
org.apache.maven.lifecycle.DefaultLifecycleExecutor.executeGoal(DefaultLifecycleExecutor.java:459)
        at
org.apache.maven.lifecycle.DefaultLifecycleExecutor.executeGoalAndHandleFailures(DefaultLifecycleExecutor.java:311)
        at
org.apache.maven.lifecycle.DefaultLifecycleExecutor.executeTaskSegments(DefaultLifecycleExecutor.java:278)
        at
org.apache.maven.lifecycle.DefaultLifecycleExecutor.execute(DefaultLifecycleExecutor.java:143)
        at
org.apache.maven.DefaultMaven.doExecute(DefaultMaven.java:334)
        at org.apache.maven.DefaultMaven.execute(DefaultMaven.java:125)
        at org.apache.maven.cli.MavenCli.main(MavenCli.java:272)
        at sun.reflect.NativeMethodAccessorImpl.invoke0(Native Method)
        at
sun.reflect.NativeMethodAccessorImpl.invoke(NativeMethodAccessorImpl.java:39)
        at
sun.reflect.DelegatingMethodAccessorImpl.invoke(DelegatingMethodAccessorImpl.java:25)
        at java.lang.reflect.Method.invoke(Method.java:585)
        at
org.codehaus.classworlds.Launcher.launchEnhanced(Launcher.java:315)
        at org.codehaus.classworlds.Launcher.launch(Launcher.java:255)
        at
org.codehaus.classworlds.Launcher.mainWithExitCode(Launcher.java:430)
        at org.codehaus.classworlds.Launcher.main(Launcher.java:375)
Caused by: org.apache.maven.plugin.MojoFailureException: There are test
failures.
        at
org.apache.maven.plugin.surefire.SurefirePlugin.execute(SurefirePlugin.java:403)
        at
org.apache.maven.plugin.DefaultPluginManager.executeMojo(DefaultPluginManager.java:443)
        at
org.apache.maven.lifecycle.DefaultLifecycleExecutor.executeGoals(DefaultLifecycleExecutor.java:539)
        ... 16 more
[INFO]
------------------------------------------------------------------------
[INFO] Total time: 13 seconds
[INFO] Finished at: Sun May 27 08:16:55 PDT 2007
[INFO] Final Memory: 16M/29M
[INFO]
------------------------------------------------------------------------
   


       
____________________________________________________________________________________Luggage?
GPS? Comic books? 
Check out fitting gifts for grads at Yahoo! Search
http://search.yahoo.com/search?fr=oni_on_mail&p=graduation+gifts&cs=bz

Mime
View raw message