geronimo-dev mailing list archives

Site index · List index
Message view « Date » · « Thread »
Top « Date » · « Thread »
From Sachin Patel <sppat...@gmail.com>
Subject axis2 test failure
Date Fri, 13 Apr 2007 13:34:23 GMT
-------------------------------------------------------
T E S T S
-------------------------------------------------------
Running org.apache.geronimo.axis2.Axis2HandlerResolverTest
Tests run: 5, Failures: 0, Errors: 0, Skipped: 0, Time elapsed: 0.859  
sec
Running org.apache.geronimo.axis2.Axis2WebServiceContainerTest
java.lang.ExceptionInInitializerError
         at org.apache.axis2.util.XMLUtils.toOM(XMLUtils.java:555)
         at org.apache.axis2.deployment.DescriptionBuilder.buildOM 
(DescriptionBuilder.java:94)
         at  
org.apache.axis2.deployment.AxisConfigBuilder.populateConfig 
(AxisConfigBuilder.java:76)
         at  
org.apache.axis2.context.ConfigurationContextFactory.createDefaultConfig 
urationContext(ConfigurationContextFactory.java:270)
         at org.apache.geronimo.axis2.Axis2WebServiceContainer.<init> 
(Axis2WebServiceContainer.java:109)
         at  
org.apache.geronimo.axis2.pojo.POJOWebServiceContainer.<init> 
(POJOWebServiceContainer.java:61)
         at  
org.apache.geronimo.axis2.Axis2WebServiceContainerTest.invokeWithWSDL 
(Axis2WebServiceContainerTest.java:144)
         at  
org.apache.geronimo.axis2.Axis2WebServiceContainerTest.testInvokeWithWSD 
L(Axis2WebServiceContainerTest.java:49)
         at sun.reflect.NativeMethodAccessorImpl.invoke0(Native Method)
         at sun.reflect.NativeMethodAccessorImpl.invoke 
(NativeMethodAccessorImpl.java:39)
         at sun.reflect.DelegatingMethodAccessorImpl.invoke 
(DelegatingMethodAccessorImpl.java:25)
         at java.lang.reflect.Method.invoke(Method.java:585)
         at junit.framework.TestCase.runTest(TestCase.java:154)
         at junit.framework.TestCase.runBare(TestCase.java:127)
         at junit.framework.TestResult$1.protect(TestResult.java:106)
         at junit.framework.TestResult.runProtected(TestResult.java:124)
         at junit.framework.TestResult.run(TestResult.java:109)
         at junit.framework.TestCase.run(TestCase.java:118)
         at junit.framework.TestSuite.runTest(TestSuite.java:208)
         at junit.framework.TestSuite.run(TestSuite.java:203)
         at sun.reflect.NativeMethodAccessorImpl.invoke0(Native Method)
         at sun.reflect.NativeMethodAccessorImpl.invoke 
(NativeMethodAccessorImpl.java:39)
         at sun.reflect.DelegatingMethodAccessorImpl.invoke 
(DelegatingMethodAccessorImpl.java:25)
         at java.lang.reflect.Method.invoke(Method.java:585)
         at org.apache.maven.surefire.junit.JUnitTestSet.execute 
(JUnitTestSet.java:210)
         at  
org.apache.maven.surefire.suite.AbstractDirectoryTestSuite.executeTestSe 
t(AbstractDirectoryTestSuite.java:135)
         at  
org.apache.maven.surefire.suite.AbstractDirectoryTestSuite.execute 
(AbstractDirectoryTestSuite.java:122)
         at org.apache.maven.surefire.Surefire.run(Surefire.java:129)
         at sun.reflect.NativeMethodAccessorImpl.invoke0(Native Method)
         at sun.reflect.NativeMethodAccessorImpl.invoke 
(NativeMethodAccessorImpl.java:39)
         at sun.reflect.DelegatingMethodAccessorImpl.invoke 
(DelegatingMethodAccessorImpl.java:25)
         at java.lang.reflect.Method.invoke(Method.java:585)
         at  
org.apache.maven.surefire.booter.SurefireBooter.runSuitesInProcess 
(SurefireBooter.java:225)
         at org.apache.maven.surefire.booter.SurefireBooter.main 
(SurefireBooter.java:747)
Caused by: java.lang.IllegalStateException: No valid ObjectCreator  
found.
         at org.apache.axiom.om.util.StAXUtils$Pool.<init> 
(StAXUtils.java:42)
         at org.apache.axiom.om.util.StAXUtils.<clinit> 
(StAXUtils.java:66)
         ... 34 more
Tests run: 3, Failures: 0, Errors: 2, Skipped: 0, Time elapsed: 0.314  
sec <<< FAILURE!

Results :
Tests run: 8, Failures: 0, Errors: 2, Skipped: 0

[INFO]  
------------------------------------------------------------------------
[ERROR] BUILD FAILURE
[INFO]  
------------------------------------------------------------------------
[INFO] There are test failures.
[INFO]  
------------------------------------------------------------------------


-sachin



Mime
View raw message