geronimo-dev mailing list archives

Site index · List index
Message view « Date » · « Thread »
Top « Date » · « Thread »
From pra...@apache.org
Subject [BUILD] TRUNK: Failed for Revision: 526107
Date Fri, 06 Apr 2007 09:18:53 GMT
Building with Maven version: 2.0.5
Revision: 526107 built with tests included
See the full build-0500.log file at http://people.apache.org/~prasad/binaries/20070406/build-0500.log
 
[WARNING] Unable to get resource 'org.apache.axis2:axis2-jaxws:pom:20070405.130315-93' from
repository central (http://repo1.maven.org/maven2)
Downloading: http://tomcat.apache.org/dev/dist/m2-repository/org/apache/axis2/axis2-metadata/20070405.130315-110/axis2-metadata-20070405.130315-110.pom
[WARNING] Unable to get resource 'org.apache.axis2:axis2-metadata:pom:20070405.130315-110'
from repository tomcat-m2-repo (http://tomcat.apache.org/dev/dist/m2-repository)
Downloading: http://people.apache.org/repo/m2-incubating-repository//org/apache/axis2/axis2-metadata/20070405.130315-110/axis2-metadata-20070405.130315-110.pom
[WARNING] Unable to get resource 'org.apache.axis2:axis2-metadata:pom:20070405.130315-110'
from repository apache-incubator (http://people.apache.org/repo/m2-incubating-repository/)
Downloading: http://repo1.maven.org/maven2/org/apache/axis2/axis2-metadata/20070405.130315-110/axis2-metadata-20070405.130315-110.pom
[WARNING] Unable to get resource 'org.apache.axis2:axis2-metadata:pom:20070405.130315-110'
from repository central (http://repo1.maven.org/maven2)
Downloading: http://tomcat.apache.org/dev/dist/m2-repository/org/apache/axis2/axis2-adb/20070406.051656-137/axis2-adb-20070406.051656-137.pom
[WARNING] Unable to get resource 'org.apache.axis2:axis2-adb:pom:20070406.051656-137' from
repository tomcat-m2-repo (http://tomcat.apache.org/dev/dist/m2-repository)
Downloading: http://people.apache.org/repo/m2-incubating-repository//org/apache/axis2/axis2-adb/20070406.051656-137/axis2-adb-20070406.051656-137.pom
[WARNING] Unable to get resource 'org.apache.axis2:axis2-adb:pom:20070406.051656-137' from
repository apache-incubator (http://people.apache.org/repo/m2-incubating-repository/)
Downloading: http://repo1.maven.org/maven2/org/apache/axis2/axis2-adb/20070406.051656-137/axis2-adb-20070406.051656-137.pom
[WARNING] Unable to get resource 'org.apache.axis2:axis2-adb:pom:20070406.051656-137' from
repository central (http://repo1.maven.org/maven2)
Downloading: http://tomcat.apache.org/dev/dist/m2-repository/org/apache/axis2/axis2-java2wsdl/20070406.051656-174/axis2-java2wsdl-20070406.051656-174.pom
[WARNING] Unable to get resource 'org.apache.axis2:axis2-java2wsdl:pom:20070406.051656-174'
from repository tomcat-m2-repo (http://tomcat.apache.org/dev/dist/m2-repository)
Downloading: http://people.apache.org/repo/m2-incubating-repository//org/apache/axis2/axis2-java2wsdl/20070406.051656-174/axis2-java2wsdl-20070406.051656-174.pom
[WARNING] Unable to get resource 'org.apache.axis2:axis2-java2wsdl:pom:20070406.051656-174'
from repository apache-incubator (http://people.apache.org/repo/m2-incubating-repository/)
Downloading: http://repo1.maven.org/maven2/org/apache/axis2/axis2-java2wsdl/20070406.051656-174/axis2-java2wsdl-20070406.051656-174.pom
[WARNING] Unable to get resource 'org.apache.axis2:axis2-java2wsdl:pom:20070406.051656-174'
from repository central (http://repo1.maven.org/maven2)
Downloading: http://tomcat.apache.org/dev/dist/m2-repository/org/apache/axis2/axis2-kernel/20070406.051656-162/axis2-kernel-20070406.051656-162.pom
[WARNING] Unable to get resource 'org.apache.axis2:axis2-kernel:pom:20070406.051656-162' from
repository tomcat-m2-repo (http://tomcat.apache.org/dev/dist/m2-repository)
Downloading: http://people.apache.org/repo/m2-incubating-repository//org/apache/axis2/axis2-kernel/20070406.051656-162/axis2-kernel-20070406.051656-162.pom
[WARNING] Unable to get resource 'org.apache.axis2:axis2-kernel:pom:20070406.051656-162' from
repository apache-incubator (http://people.apache.org/repo/m2-incubating-repository/)
Downloading: http://repo1.maven.org/maven2/org/apache/axis2/axis2-kernel/20070406.051656-162/axis2-kernel-20070406.051656-162.pom
[WARNING] Unable to get resource 'org.apache.axis2:axis2-kernel:pom:20070406.051656-162' from
repository central (http://repo1.maven.org/maven2)
[INFO] [antrun:run {execution: generate-test-sources}]
[INFO] Executing tasks
     [echo] Generating java from test_service_simple.wsdl
    [mkdir] Created dir: /home/prasad/geronimo/trunk/modules/geronimo-axis2/target/schema/src
     [echo] Generating java from test_service_doclitbare.wsdl
     [echo] Generating java from test_service_rpclit.wsdl
[INFO] Executed tasks
[INFO] [resources:testResources]
[INFO] Using default encoding to copy filtered resources.
[INFO] [compiler:testCompile]
[INFO] Compiling 22 source files to /home/prasad/geronimo/trunk/modules/geronimo-axis2/target/test-classes
[INFO] [surefire:test]
[INFO] Surefire report directory: /home/prasad/geronimo/trunk/modules/geronimo-axis2/target/surefire-reports

-------------------------------------------------------
 T E S T S
-------------------------------------------------------
Running org.apache.geronimo.axis2.Axis2HandlerResolverTest
Tests run: 5, Failures: 0, Errors: 0, Skipped: 0, Time elapsed: 0.743 sec
Running org.apache.geronimo.axis2.Axis2WebServiceContainerTest
java.lang.ExceptionInInitializerError
	at org.apache.axis2.util.XMLUtils.toOM(XMLUtils.java:555)
	at org.apache.axis2.deployment.DescriptionBuilder.buildOM(DescriptionBuilder.java:93)
	at org.apache.axis2.deployment.AxisConfigBuilder.populateConfig(AxisConfigBuilder.java:76)
	at org.apache.axis2.context.ConfigurationContextFactory.createDefaultConfigurationContext(ConfigurationContextFactory.java:270)
	at org.apache.geronimo.axis2.Axis2WebServiceContainer.<init>(Axis2WebServiceContainer.java:109)
	at org.apache.geronimo.axis2.pojo.POJOWebServiceContainer.<init>(POJOWebServiceContainer.java:61)
	at org.apache.geronimo.axis2.Axis2WebServiceContainerTest.invokeWithWSDL(Axis2WebServiceContainerTest.java:144)
	at org.apache.geronimo.axis2.Axis2WebServiceContainerTest.testInvokeWithWSDL(Axis2WebServiceContainerTest.java:49)
	at sun.reflect.NativeMethodAccessorImpl.invoke0(Native Method)
	at sun.reflect.NativeMethodAccessorImpl.invoke(NativeMethodAccessorImpl.java:39)
	at sun.reflect.DelegatingMethodAccessorImpl.invoke(DelegatingMethodAccessorImpl.java:25)
	at java.lang.reflect.Method.invoke(Method.java:585)
	at junit.framework.TestCase.runTest(TestCase.java:154)
	at junit.framework.TestCase.runBare(TestCase.java:127)
	at junit.framework.TestResult$1.protect(TestResult.java:106)
	at junit.framework.TestResult.runProtected(TestResult.java:124)
	at junit.framework.TestResult.run(TestResult.java:109)
	at junit.framework.TestCase.run(TestCase.java:118)
	at junit.framework.TestSuite.runTest(TestSuite.java:208)
	at junit.framework.TestSuite.run(TestSuite.java:203)
	at sun.reflect.NativeMethodAccessorImpl.invoke0(Native Method)
	at sun.reflect.NativeMethodAccessorImpl.invoke(NativeMethodAccessorImpl.java:39)
	at sun.reflect.DelegatingMethodAccessorImpl.invoke(DelegatingMethodAccessorImpl.java:25)
	at java.lang.reflect.Method.invoke(Method.java:585)
	at org.apache.maven.surefire.junit.JUnitTestSet.execute(JUnitTestSet.java:210)
	at org.apache.maven.surefire.suite.AbstractDirectoryTestSuite.executeTestSet(AbstractDirectoryTestSuite.java:135)
	at org.apache.maven.surefire.suite.AbstractDirectoryTestSuite.execute(AbstractDirectoryTestSuite.java:122)
	at org.apache.maven.surefire.Surefire.run(Surefire.java:129)
	at sun.reflect.NativeMethodAccessorImpl.invoke0(Native Method)
	at sun.reflect.NativeMethodAccessorImpl.invoke(NativeMethodAccessorImpl.java:39)
	at sun.reflect.DelegatingMethodAccessorImpl.invoke(DelegatingMethodAccessorImpl.java:25)
	at java.lang.reflect.Method.invoke(Method.java:585)
	at org.apache.maven.surefire.booter.SurefireBooter.runSuitesInProcess(SurefireBooter.java:225)
	at org.apache.maven.surefire.booter.SurefireBooter.main(SurefireBooter.java:747)
Caused by: java.lang.IllegalStateException: No valid ObjectCreator found.
	at org.apache.axiom.om.util.StAXUtils$Pool.<init>(StAXUtils.java:42)
	at org.apache.axiom.om.util.StAXUtils.<clinit>(StAXUtils.java:66)
	... 34 more
Tests run: 3, Failures: 0, Errors: 2, Skipped: 0, Time elapsed: 0.357 sec <<< FAILURE!

Results :
Tests run: 8, Failures: 0, Errors: 2, Skipped: 0

[INFO] ------------------------------------------------------------------------
[ERROR] BUILD FAILURE
[INFO] ------------------------------------------------------------------------
[INFO] There are test failures.
[INFO] ------------------------------------------------------------------------
[INFO] For more information, run Maven with the -e switch
[INFO] ------------------------------------------------------------------------
[INFO] Total time: 19 minutes 44 seconds
[INFO] Finished at: Fri Apr 06 05:24:41 EDT 2007
[INFO] Final Memory: 85M/971M
[INFO] ------------------------------------------------------------------------

Mime
View raw message