geronimo-dev mailing list archives

Site index · List index
Message view « Date » · « Thread »
Top « Date » · « Thread »
From pra...@apache.org
Subject [BUILD] TRUNK: Failed for Revision: 524748
Date Mon, 02 Apr 2007 09:20:11 GMT
Building with Maven version: 2.0.5
Revision: 524748 built with tests included
See the full build-0500.log file at http://people.apache.org/~prasad/binaries/20070402/build-0500.log
 
Downloading: http://people.apache.org/repo/m2-incubating-repository//org/codehaus/woodstox/wstx-asl/3.2.0/wstx-asl-3.2.0.jar
[WARNING] Unable to get resource 'org.codehaus.woodstox:wstx-asl:jar:3.2.0' from repository
apache-incubator (http://people.apache.org/repo/m2-incubating-repository/)
Downloading: http://repository.codehaus.org/org/codehaus/woodstox/wstx-asl/3.2.0/wstx-asl-3.2.0.jar
493K downloaded
[WARNING] *** CHECKSUM FAILED - Error retrieving checksum file for org/codehaus/woodstox/wstx-asl/3.2.0/wstx-asl-3.2.0.jar
- IGNORING
Downloading: http://tomcat.apache.org/dev/dist/m2-repository//commons-httpclient/commons-httpclient/3.0.1/commons-httpclient-3.0.1.jar
[WARNING] Unable to get resource 'commons-httpclient:commons-httpclient:jar:3.0.1' from repository
tomcat-m2-repo (http://tomcat.apache.org/dev/dist/m2-repository/)
Downloading: http://people.apache.org/repo/m2-incubating-repository//commons-httpclient/commons-httpclient/3.0.1/commons-httpclient-3.0.1.jar
[WARNING] Unable to get resource 'commons-httpclient:commons-httpclient:jar:3.0.1' from repository
apache-incubator (http://people.apache.org/repo/m2-incubating-repository/)
Downloading: http://repository.codehaus.org/commons-httpclient/commons-httpclient/3.0.1/commons-httpclient-3.0.1.jar
[WARNING] Unable to get resource 'commons-httpclient:commons-httpclient:jar:3.0.1' from repository
codehaus (http://repository.codehaus.org)
Downloading: http://ws.zones.apache.org/repository2//commons-httpclient/commons-httpclient/3.0.1/commons-httpclient-3.0.1.jar
[WARNING] Unable to get resource 'commons-httpclient:commons-httpclient:jar:3.0.1' from repository
apache-ws-snapshots2 (http://ws.zones.apache.org/repository2/)
Downloading: http://repo1.maven.org/maven2//commons-httpclient/commons-httpclient/3.0.1/commons-httpclient-3.0.1.jar
273K downloaded
Downloading: http://people.apache.org/repo/m2-snapshot-repository/org/apache/axis2/axis2-kernel/SNAPSHOT/axis2-kernel-20070401.014134-137.jar
887K downloaded
Downloading: http://tomcat.apache.org/dev/dist/m2-repository//javax/mail/mail/1.4/mail-1.4.jar
[WARNING] Unable to get resource 'javax.mail:mail:jar:1.4' from repository tomcat-m2-repo
(http://tomcat.apache.org/dev/dist/m2-repository/)
Downloading: http://people.apache.org/repo/m2-incubating-repository//javax/mail/mail/1.4/mail-1.4.jar
[WARNING] Unable to get resource 'javax.mail:mail:jar:1.4' from repository apache-incubator
(http://people.apache.org/repo/m2-incubating-repository/)
Downloading: http://repository.codehaus.org/javax/mail/mail/1.4/mail-1.4.jar
[WARNING] Unable to get resource 'javax.mail:mail:jar:1.4' from repository codehaus (http://repository.codehaus.org)
Downloading: http://repo1.maven.org/maven2/javax/mail/mail/1.4/mail-1.4.jar
379K downloaded
[INFO] [compiler:compile]
[INFO] Compiling 11 source files to /home/prasad/geronimo/trunk/modules/geronimo-axis2/target/classes
Downloading: http://tomcat.apache.org/dev/dist/m2-repository//org/apache/axis2/axis2-jaxws/20070330.190024-85/axis2-jaxws-20070330.190024-85.pom
[WARNING] Unable to get resource 'org.apache.axis2:axis2-jaxws:pom:20070330.190024-85' from
repository tomcat-m2-repo (http://tomcat.apache.org/dev/dist/m2-repository/)
Downloading: http://people.apache.org/repo/m2-incubating-repository//org/apache/axis2/axis2-jaxws/20070330.190024-85/axis2-jaxws-20070330.190024-85.pom
[WARNING] Unable to get resource 'org.apache.axis2:axis2-jaxws:pom:20070330.190024-85' from
repository apache-incubator (http://people.apache.org/repo/m2-incubating-repository/)
Downloading: http://repository.codehaus.org/org/apache/axis2/axis2-jaxws/20070330.190024-85/axis2-jaxws-20070330.190024-85.pom
[WARNING] Unable to get resource 'org.apache.axis2:axis2-jaxws:pom:20070330.190024-85' from
repository codehaus (http://repository.codehaus.org)
Downloading: http://repo1.maven.org/maven2/org/apache/axis2/axis2-jaxws/20070330.190024-85/axis2-jaxws-20070330.190024-85.pom
[WARNING] Unable to get resource 'org.apache.axis2:axis2-jaxws:pom:20070330.190024-85' from
repository central (http://repo1.maven.org/maven2)
[INFO] [antrun:run {execution: generate-test-sources}]
[INFO] Executing tasks
     [echo] Generating java from test_service_simple.wsdl
    [mkdir] Created dir: /home/prasad/geronimo/trunk/modules/geronimo-axis2/target/schema/src
     [echo] Generating java from test_service_doclitbare.wsdl
     [echo] Generating java from test_service_rpclit.wsdl
[INFO] Executed tasks
[INFO] [resources:testResources]
[INFO] Using default encoding to copy filtered resources.
[INFO] [compiler:testCompile]
[INFO] Compiling 22 source files to /home/prasad/geronimo/trunk/modules/geronimo-axis2/target/test-classes
[INFO] [surefire:test]
[INFO] Surefire report directory: /home/prasad/geronimo/trunk/modules/geronimo-axis2/target/surefire-reports

-------------------------------------------------------
 T E S T S
-------------------------------------------------------
Running org.apache.geronimo.axis2.Axis2HandlerResolverTest
Tests run: 5, Failures: 0, Errors: 0, Skipped: 0, Time elapsed: 0.743 sec
Running org.apache.geronimo.axis2.Axis2WebServiceContainerTest
java.lang.NoClassDefFoundError: org/apache/axis2/description/TransportOutDescription
	at org.apache.geronimo.axis2.Axis2WebServiceContainerTest.invokeWithWSDL(Axis2WebServiceContainerTest.java:144)
	at org.apache.geronimo.axis2.Axis2WebServiceContainerTest.testInvokeWithWSDL(Axis2WebServiceContainerTest.java:49)
	at sun.reflect.NativeMethodAccessorImpl.invoke0(Native Method)
	at sun.reflect.NativeMethodAccessorImpl.invoke(NativeMethodAccessorImpl.java:39)
	at sun.reflect.DelegatingMethodAccessorImpl.invoke(DelegatingMethodAccessorImpl.java:25)
	at java.lang.reflect.Method.invoke(Method.java:585)
	at junit.framework.TestCase.runTest(TestCase.java:154)
	at junit.framework.TestCase.runBare(TestCase.java:127)
	at junit.framework.TestResult$1.protect(TestResult.java:106)
	at junit.framework.TestResult.runProtected(TestResult.java:124)
	at junit.framework.TestResult.run(TestResult.java:109)
	at junit.framework.TestCase.run(TestCase.java:118)
	at junit.framework.TestSuite.runTest(TestSuite.java:208)
	at junit.framework.TestSuite.run(TestSuite.java:203)
	at sun.reflect.NativeMethodAccessorImpl.invoke0(Native Method)
	at sun.reflect.NativeMethodAccessorImpl.invoke(NativeMethodAccessorImpl.java:39)
	at sun.reflect.DelegatingMethodAccessorImpl.invoke(DelegatingMethodAccessorImpl.java:25)
	at java.lang.reflect.Method.invoke(Method.java:585)
	at org.apache.maven.surefire.junit.JUnitTestSet.execute(JUnitTestSet.java:210)
	at org.apache.maven.surefire.suite.AbstractDirectoryTestSuite.executeTestSet(AbstractDirectoryTestSuite.java:135)
	at org.apache.maven.surefire.suite.AbstractDirectoryTestSuite.execute(AbstractDirectoryTestSuite.java:122)
	at org.apache.maven.surefire.Surefire.run(Surefire.java:129)
	at sun.reflect.NativeMethodAccessorImpl.invoke0(Native Method)
	at sun.reflect.NativeMethodAccessorImpl.invoke(NativeMethodAccessorImpl.java:39)
	at sun.reflect.DelegatingMethodAccessorImpl.invoke(DelegatingMethodAccessorImpl.java:25)
	at java.lang.reflect.Method.invoke(Method.java:585)
	at org.apache.maven.surefire.booter.SurefireBooter.runSuitesInProcess(SurefireBooter.java:225)
	at org.apache.maven.surefire.booter.SurefireBooter.main(SurefireBooter.java:747)
Tests run: 3, Failures: 0, Errors: 2, Skipped: 0, Time elapsed: 0.364 sec <<< FAILURE!

Results :
Tests run: 8, Failures: 0, Errors: 2, Skipped: 0

[INFO] ------------------------------------------------------------------------
[ERROR] BUILD FAILURE
[INFO] ------------------------------------------------------------------------
[INFO] There are test failures.
[INFO] ------------------------------------------------------------------------
[INFO] For more information, run Maven with the -e switch
[INFO] ------------------------------------------------------------------------
[INFO] Total time: 16 minutes 34 seconds
[INFO] Finished at: Mon Apr 02 05:25:32 EDT 2007
[INFO] Final Memory: 85M/966M
[INFO] ------------------------------------------------------------------------

Mime
View raw message