geronimo-dev mailing list archives

Site index · List index
Message view « Date » · « Thread »
Top « Date » · « Thread »
From pra...@apache.org
Subject [BUILD] TRUNK: Failed for Revision: 516672
Date Sat, 10 Mar 2007 10:04:22 GMT
Building with Maven version: 2.0.5
Revision: 516672 built with tests included
See the full build-0500.log file at http://people.apache.org/~prasad/binaries/20070310/build-0500.log
 
[INFO] Checking legal files in: geronimo-j2ee-2.0-SNAPSHOT.jar
[INFO] [install:install]
[INFO] Installing /home/prasad/geronimo/trunk/modules/geronimo-j2ee/target/geronimo-j2ee-2.0-SNAPSHOT.jar
to /home/prasad/.m2/repository/org/apache/geronimo/modules/geronimo-j2ee/2.0-SNAPSHOT/geronimo-j2ee-2.0-SNAPSHOT.jar
[INFO] ----------------------------------------------------------------------------
[INFO] Building Geronimo :: Naming
[INFO]    task-segment: [install]
[INFO] ----------------------------------------------------------------------------
[INFO] [tools:require-java-version {execution: validate-java-version}]
[INFO] [tools:copy-legal-files {execution: install-legal-files}]
[INFO] Created dir: /home/prasad/geronimo/trunk/modules/geronimo-naming/target/classes/META-INF
[INFO] Copying 2 files to /home/prasad/geronimo/trunk/modules/geronimo-naming/target/classes/META-INF
[INFO] [resources:resources]
[INFO] Using default encoding to copy filtered resources.
[INFO] snapshot org.apache.xbean:xbean-naming:3.0-SNAPSHOT: checking for updates from apache-snapshots
[INFO] snapshot org.apache.xbean:xbean-naming:3.0-SNAPSHOT: checking for updates from axis2-m2-repo
[INFO] snapshot org.apache.xbean:xbean-naming:3.0-SNAPSHOT: checking for updates from codehaus-snapshots
[INFO] snapshot org.apache.xbean:xbean-naming:3.0-SNAPSHOT: checking for updates from apache.snapshots
Downloading: http://people.apache.org/repo/m2-snapshot-repository/org/apache/xbean/xbean-naming/3.0-SNAPSHOT/xbean-naming-3.0-20070310.023016-4.pom
1K downloaded
Downloading: http://tomcat.apache.org/dev/dist/m2-repository//backport-util-concurrent/backport-util-concurrent/2.1/backport-util-concurrent-2.1.pom
[WARNING] Unable to get resource 'backport-util-concurrent:backport-util-concurrent:pom:2.1'
from repository tomcat-m2-repo (http://tomcat.apache.org/dev/dist/m2-repository/)
Downloading: http://ws.zones.apache.org/repository2//backport-util-concurrent/backport-util-concurrent/2.1/backport-util-concurrent-2.1.pom
[WARNING] Unable to get resource 'backport-util-concurrent:backport-util-concurrent:pom:2.1'
from repository axis2-m2-repo (http://ws.zones.apache.org/repository2/)
Downloading: http://people.apache.org/repo/m2-incubating-repository//backport-util-concurrent/backport-util-concurrent/2.1/backport-util-concurrent-2.1.pom
[WARNING] Unable to get resource 'backport-util-concurrent:backport-util-concurrent:pom:2.1'
from repository apache-incubator (http://people.apache.org/repo/m2-incubating-repository/)
Downloading: http://repository.codehaus.org/backport-util-concurrent/backport-util-concurrent/2.1/backport-util-concurrent-2.1.pom
[WARNING] Unable to get resource 'backport-util-concurrent:backport-util-concurrent:pom:2.1'
from repository codehaus (http://repository.codehaus.org)
Downloading: http://repo1.maven.org/maven2/backport-util-concurrent/backport-util-concurrent/2.1/backport-util-concurrent-2.1.pom
909b downloaded
Downloading: http://tomcat.apache.org/dev/dist/m2-repository//org/apache/geronimo/specs/geronimo-jta_1.1_spec/1.0/geronimo-jta_1.1_spec-1.0.pom
[WARNING] Unable to get resource 'org.apache.geronimo.specs:geronimo-jta_1.1_spec:pom:1.0'
from repository tomcat-m2-repo (http://tomcat.apache.org/dev/dist/m2-repository/)
Downloading: http://ws.zones.apache.org/repository2//org/apache/geronimo/specs/geronimo-jta_1.1_spec/1.0/geronimo-jta_1.1_spec-1.0.pom
[WARNING] Unable to get resource 'org.apache.geronimo.specs:geronimo-jta_1.1_spec:pom:1.0'
from repository axis2-m2-repo (http://ws.zones.apache.org/repository2/)
Downloading: http://people.apache.org/repo/m2-incubating-repository//org/apache/geronimo/specs/geronimo-jta_1.1_spec/1.0/geronimo-jta_1.1_spec-1.0.pom
[WARNING] Unable to get resource 'org.apache.geronimo.specs:geronimo-jta_1.1_spec:pom:1.0'
from repository apache-incubator (http://people.apache.org/repo/m2-incubating-repository/)
Downloading: http://repository.codehaus.org/org/apache/geronimo/specs/geronimo-jta_1.1_spec/1.0/geronimo-jta_1.1_spec-1.0.pom
[WARNING] Unable to get resource 'org.apache.geronimo.specs:geronimo-jta_1.1_spec:pom:1.0'
from repository codehaus (http://repository.codehaus.org)
Downloading: http://repo1.maven.org/maven2/org/apache/geronimo/specs/geronimo-jta_1.1_spec/1.0/geronimo-jta_1.1_spec-1.0.pom
411b downloaded
Downloading: http://tomcat.apache.org/dev/dist/m2-repository//org/apache/geronimo/specs/geronimo-jta_1.1_spec/1.0/geronimo-jta_1.1_spec-1.0.jar
[WARNING] Unable to get resource 'org.apache.geronimo.specs:geronimo-jta_1.1_spec:jar:1.0'
from repository tomcat-m2-repo (http://tomcat.apache.org/dev/dist/m2-repository/)
Downloading: http://ws.zones.apache.org/repository2//org/apache/geronimo/specs/geronimo-jta_1.1_spec/1.0/geronimo-jta_1.1_spec-1.0.jar
[WARNING] Unable to get resource 'org.apache.geronimo.specs:geronimo-jta_1.1_spec:jar:1.0'
from repository axis2-m2-repo (http://ws.zones.apache.org/repository2/)
Downloading: http://people.apache.org/repo/m2-incubating-repository//org/apache/geronimo/specs/geronimo-jta_1.1_spec/1.0/geronimo-jta_1.1_spec-1.0.jar
[WARNING] Unable to get resource 'org.apache.geronimo.specs:geronimo-jta_1.1_spec:jar:1.0'
from repository apache-incubator (http://people.apache.org/repo/m2-incubating-repository/)
Downloading: http://repository.codehaus.org/org/apache/geronimo/specs/geronimo-jta_1.1_spec/1.0/geronimo-jta_1.1_spec-1.0.jar
[WARNING] Unable to get resource 'org.apache.geronimo.specs:geronimo-jta_1.1_spec:jar:1.0'
from repository codehaus (http://repository.codehaus.org)
Downloading: http://repo1.maven.org/maven2/org/apache/geronimo/specs/geronimo-jta_1.1_spec/1.0/geronimo-jta_1.1_spec-1.0.jar
14K downloaded
Downloading: http://people.apache.org/repo/m2-snapshot-repository/org/apache/xbean/xbean-naming/3.0-SNAPSHOT/xbean-naming-3.0-20070310.023016-4.jar
48K downloaded
Downloading: http://tomcat.apache.org/dev/dist/m2-repository//backport-util-concurrent/backport-util-concurrent/2.1/backport-util-concurrent-2.1.jar
[WARNING] Unable to get resource 'backport-util-concurrent:backport-util-concurrent:jar:2.1'
from repository tomcat-m2-repo (http://tomcat.apache.org/dev/dist/m2-repository/)
Downloading: http://ws.zones.apache.org/repository2//backport-util-concurrent/backport-util-concurrent/2.1/backport-util-concurrent-2.1.jar
[WARNING] Unable to get resource 'backport-util-concurrent:backport-util-concurrent:jar:2.1'
from repository axis2-m2-repo (http://ws.zones.apache.org/repository2/)
Downloading: http://people.apache.org/repo/m2-incubating-repository//backport-util-concurrent/backport-util-concurrent/2.1/backport-util-concurrent-2.1.jar
[WARNING] Unable to get resource 'backport-util-concurrent:backport-util-concurrent:jar:2.1'
from repository apache-incubator (http://people.apache.org/repo/m2-incubating-repository/)
Downloading: http://repository.codehaus.org/backport-util-concurrent/backport-util-concurrent/2.1/backport-util-concurrent-2.1.jar
[WARNING] Unable to get resource 'backport-util-concurrent:backport-util-concurrent:jar:2.1'
from repository codehaus (http://repository.codehaus.org)
Downloading: http://repo1.maven.org/maven2/backport-util-concurrent/backport-util-concurrent/2.1/backport-util-concurrent-2.1.jar
321K downloaded
[INFO] [compiler:compile]
[INFO] Compiling 19 source files to /home/prasad/geronimo/trunk/modules/geronimo-naming/target/classes
[INFO] [resources:testResources]
[INFO] Using default encoding to copy filtered resources.
Downloading: http://people.apache.org/repo/m2-snapshot-repository/org/apache/xbean/xbean-naming/3.0-SNAPSHOT/xbean-naming-3.0-20070310.023016-4.pom
1K downloaded
[INFO] [compiler:testCompile]
[INFO] Compiling 6 source files to /home/prasad/geronimo/trunk/modules/geronimo-naming/target/test-classes
[INFO] [surefire:test]
[INFO] Surefire report directory: /home/prasad/geronimo/trunk/modules/geronimo-naming/target/surefire-reports

-------------------------------------------------------
 T E S T S
-------------------------------------------------------
Running org.apache.geronimo.gjndi.binding.GBeanBindingTest
05:07:05,947 ERROR [ConfigurationUtil] Cound not determine the installation directory of Apache
Geronimo, because the startup jar could not be found in the current class loader.
Tests run: 1, Failures: 0, Errors: 0, Skipped: 0, Time elapsed: 1.246 sec
Running org.apache.geronimo.gjndi.KernelContextGBeanTest
Tests run: 1, Failures: 0, Errors: 0, Skipped: 0, Time elapsed: 0.369 sec
Running org.apache.geronimo.gjndi.JavaCompGBeanTest
Tests run: 1, Failures: 0, Errors: 0, Skipped: 0, Time elapsed: 0.206 sec
Running org.apache.geronimo.gjndi.JavaCompContextTest
lookup(String) milliseconds: 2041
Tests run: 9, Failures: 0, Errors: 1, Skipped: 0, Time elapsed: 2.076 sec <<< FAILURE!

Results :
Tests run: 12, Failures: 0, Errors: 1, Skipped: 0

[INFO] ------------------------------------------------------------------------
[ERROR] BUILD FAILURE
[INFO] ------------------------------------------------------------------------
[INFO] There are test failures.
[INFO] ------------------------------------------------------------------------
[INFO] For more information, run Maven with the -e switch
[INFO] ------------------------------------------------------------------------
[INFO] Total time: 3 minutes 14 seconds
[INFO] Finished at: Sat Mar 10 05:07:09 EST 2007
[INFO] Final Memory: 72M/553M
[INFO] ------------------------------------------------------------------------

Mime
View raw message