geronimo-dev mailing list archives

Site index · List index
Message view « Date » · « Thread »
Top « Date » · « Thread »
From "Kevan Miller (JIRA)" <>
Subject [jira] Created: (GERONIMO-2950) Build test failure in geronimo-naming
Date Sat, 10 Mar 2007 17:28:09 GMT
Build test failure in geronimo-naming

                 Key: GERONIMO-2950
             Project: Geronimo
          Issue Type: Bug
      Security Level: public (Regular issues)
            Reporter: Kevan Miller
         Assigned To: Dain Sundstrom

server/trunk builds are failing in geronimo-naming junit tests. 

Running org.apache.geronimo.gjndi.JavaCompContextTest
lookup(String) milliseconds: 432
Tests run: 9, Failures: 0, Errors: 1, Skipped: 0, Time elapsed: 0.461 sec <<< FAILURE!

Test set: org.apache.geronimo.gjndi.JavaCompContextTest
Tests run: 9, Failures: 0, Errors: 1, Skipped: 0, Time elapsed: 0.462 sec <<< FAILURE!
testSchemeLookup(org.apache.geronimo.gjndi.JavaCompContextTest)  Time elapsed: 0.006 sec 
<<< ERROR!
javax.naming.NotContextException: java:comp/env/hello
        at org.apache.xbean.naming.context.AbstractContext.lookup(
        at org.apache.xbean.naming.context.AbstractContext.lookup(
        at org.apache.xbean.naming.context.ContextFlyweight.lookup(
        at org.apache.geronimo.gjndi.JavaCompContextTest.testSchemeLookup(

I'm going to remove the test and have Dain fix...

This message is automatically generated by JIRA.
You can reply to this email to add a comment to the issue online.

View raw message