geronimo-dev mailing list archives

Site index · List index
Message view « Date » · « Thread »
Top « Date » · « Thread »
From "Prasad Kashyap" <goyathlay.geron...@gmail.com>
Subject Re: [BUILD] Failed for Revision: 505868
Date Tue, 13 Feb 2007 02:57:52 GMT
This has been fixed already. The cron job had the same JAVA_HOME but I
had to change the path by putting my assigned JAVA_HOME at the front.

Cheers
Prasad

On 2/12/07, Jason Dillon <jason@planet57.com> wrote:
> Are you sure the cron job executes with the same path and/or JAVA_HOME?
>
> --jason
>
>
> On Feb 12, 2007, at 9:09 AM, Prasad Kashyap wrote:
>
> > bubbleboy:/usr/lib/jvm>java -version
> > java version "1.5.0_08"
> > Java(TM) 2 Runtime Environment, Standard Edition (build 1.5.0_08-b03)
> > Java HotSpot(TM) Server VM (build 1.5.0_08-b03, mixed mode)
> >
> > The file /usr/lib/libgcj.so.5.0.0 exists. I have discovered that this
> > error occurs only during the cron job. The tests pass successfully
> > when the geronimo-activation module is built directly. I'm trying to
> > fix this now.
> >
> > Cheers
> > Prasad
> >
> > On 2/11/07, Jason Dillon <jason@planet57.com> wrote:
> >> What version of Java is this using?  The '/usr/lib/libgcj.so.5.0.0'
> >> looks suspicious...
> >>
> >> --jason
> >>
> >>
> >> On Feb 11, 2007, at 2:04 AM, prasad@apache.org wrote:
> >>
> >> > Revision: 505868 built with tests included
> >> > See the full build-050044.log file at http://people.apache.org/
> >> > ~prasad/binaries/20070211/build-050044.log
> >> >
> >> > [INFO]    task-segment: [install]
> >> > [INFO]
> >> >
> >> ---------------------------------------------------------------------
> >> -
> >> > ------
> >> > [INFO] [tools:require-java-version {execution: validate-java-
> >> version}]
> >> > [INFO] [tools:copy-legal-files {execution: install-legal-files}]
> >> > [INFO] Created dir: /home/prasad/geronimo/trunk/testsupport/test-
> >> > deployment-javaee_5/test-war-javaee_5/target/classes/META-INF
> >> > [INFO] Copying 2 files to /home/prasad/geronimo/trunk/testsupport/
> >> > test-deployment-javaee_5/test-war-javaee_5/target/classes/META-INF
> >> > [INFO] [resources:resources]
> >> > [INFO] Using default encoding to copy filtered resources.
> >> > [INFO] [compiler:compile]
> >> > [INFO] No sources to compile
> >> > [INFO] [resources:testResources]
> >> > [INFO] Using default encoding to copy filtered resources.
> >> > [INFO] [compiler:testCompile]
> >> > [INFO] No sources to compile
> >> > [INFO] [surefire:test]
> >> > [INFO] No tests to run.
> >> > [INFO] [war:war]
> >> > [INFO] Exploding webapp...
> >> > [INFO] Assembling webapp test-war-javaee_5 in /home/prasad/
> >> geronimo/
> >> > trunk/testsupport/test-deployment-javaee_5/test-war-javaee_5/
> >> target/
> >> > test-war-javaee_5-2.0-SNAPSHOT
> >> > [INFO] Copy webapp webResources to /home/prasad/geronimo/trunk/
> >> > testsupport/test-deployment-javaee_5/test-war-javaee_5/target/test-
> >> > war-javaee_5-2.0-SNAPSHOT
> >> > [INFO] Building jar: /home/prasad/geronimo/trunk/testsupport/test-
> >> > deployment-javaee_5/test-war-javaee_5/target/test-war-javaee_5-2.0-
> >> > SNAPSHOT/WEB-INF/lib/test-war-javaee_5-2.0-SNAPSHOT.jar
> >> > [INFO] Generating war /home/prasad/geronimo/trunk/testsupport/test-
> >> > deployment-javaee_5/test-war-javaee_5/target/test-war-javaee_5-2.0-
> >> > SNAPSHOT.war
> >> > [INFO] Building war: /home/prasad/geronimo/trunk/testsupport/test-
> >> > deployment-javaee_5/test-war-javaee_5/target/test-war-javaee_5-2.0-
> >> > SNAPSHOT.war
> >> > [INFO] [install:install]
> >> > [INFO] Installing /home/prasad/geronimo/trunk/testsupport/test-
> >> > deployment-javaee_5/test-war-javaee_5/target/test-war-javaee_5-2.0-
> >> > SNAPSHOT.war to /home/prasad/.m2/repository/org/apache/geronimo/
> >> > testsupport/test-war-javaee_5/2.0-SNAPSHOT/test-war-javaee_5-2.0-
> >> > SNAPSHOT.war
> >> > [INFO]
> >> >
> >> ---------------------------------------------------------------------
> >> -
> >> > ------
> >> > [INFO] Building Geronimo Test Support, Test Deployment JAVAEE
> >> 5 :: RAR
> >> > [INFO]    task-segment: [install]
> >> > [INFO]
> >> >
> >> ---------------------------------------------------------------------
> >> -
> >> > ------
> >> > [INFO] [tools:require-java-version {execution: validate-java-
> >> version}]
> >> > [INFO] [tools:copy-legal-files {execution: install-legal-files}]
> >> > [INFO] Created dir: /home/prasad/geronimo/trunk/testsupport/test-
> >> > deployment-javaee_5/test-rar-javaee_5/target/classes/META-INF
> >> > [INFO] Copying 2 files to /home/prasad/geronimo/trunk/testsupport/
> >> > test-deployment-javaee_5/test-rar-javaee_5/target/classes/META-INF
> >> > [INFO] [resources:resources]
> >> > [INFO] Using default encoding to copy filtered resources.
> >> > [INFO] [compiler:compile]
> >> > [INFO] No sources to compile
> >> > [INFO] [resources:testResources]
> >> > [INFO] Using default encoding to copy filtered resources.
> >> > [INFO] [compiler:testCompile]
> >> > [INFO] No sources to compile
> >> > [INFO] [surefire:test]
> >> > [INFO] No tests to run.
> >> > [INFO] [rar:rar]
> >> > [INFO] Copy rar resources to /home/prasad/geronimo/trunk/
> >> > testsupport/test-deployment-javaee_5/test-rar-javaee_5/target/test-
> >> > rar-javaee_5-2.0-SNAPSHOT
> >> > [INFO] Using ra.xml /home/prasad/geronimo/trunk/testsupport/test-
> >> > deployment-javaee_5/test-rar-javaee_5/src/main/rar/META-INF/ra.xml
> >> > [INFO] Could not find manifest file: /home/prasad/geronimo/trunk/
> >> > testsupport/test-deployment-javaee_5/test-rar-javaee_5/src/main/
> >> rar/
> >> > META-INF/MANIFEST.MF - Generating one
> >> > [INFO] Building jar: /home/prasad/geronimo/trunk/testsupport/test-
> >> > deployment-javaee_5/test-rar-javaee_5/target/test-rar-javaee_5-2.0-
> >> > SNAPSHOT.rar
> >> > [INFO] [install:install]
> >> > [INFO] Installing /home/prasad/geronimo/trunk/testsupport/test-
> >> > deployment-javaee_5/test-rar-javaee_5/target/test-rar-javaee_5-2.0-
> >> > SNAPSHOT.rar to /home/prasad/.m2/repository/org/apache/geronimo/
> >> > testsupport/test-rar-javaee_5/2.0-SNAPSHOT/test-rar-javaee_5-2.0-
> >> > SNAPSHOT.rar
> >> > [INFO]
> >> >
> >> ---------------------------------------------------------------------
> >> -
> >> > ------
> >> > [INFO] Building Geronimo Test Support, Test Deployment JAVAEE
> >> 5 :: EAR
> >> > [INFO]    task-segment: [install]
> >> > [INFO]
> >> >
> >> ---------------------------------------------------------------------
> >> -
> >> > ------
> >> > [INFO] [tools:require-java-version {execution: validate-java-
> >> version}]
> >> > [INFO] [ear:generate-application-xml]
> >> > [INFO] Generating application.xml
> >> > [INFO] [tools:copy-legal-files {execution: install-legal-files}]
> >> > [INFO] Created dir: /home/prasad/geronimo/trunk/testsupport/test-
> >> > deployment-javaee_5/test-ear-javaee_5/target/classes/META-INF
> >> > [INFO] Copying 2 files to /home/prasad/geronimo/trunk/testsupport/
> >> > test-deployment-javaee_5/test-ear-javaee_5/target/classes/META-INF
> >> > [INFO] [resources:resources]
> >> > [INFO] Using default encoding to copy filtered resources.
> >> > [INFO] [ear:ear]
> >> > [INFO] Copying artifact[war:org.apache.geronimo.testsupport:test-
> >> > war-javaee_5:2.0-SNAPSHOT] to[web.war]
> >> > [INFO] Copying artifact[ejb:org.apache.geronimo.testsupport:test-
> >> > ejb-javaee_5:2.0-SNAPSHOT] to[ejb.jar]
> >> > [INFO] Copying artifact[rar:org.apache.geronimo.testsupport:test-
> >> > rar-javaee_5:2.0-SNAPSHOT] to[rar.rar]
> >> > [INFO] Copy ear resources to /home/prasad/geronimo/trunk/
> >> > testsupport/test-deployment-javaee_5/test-ear-javaee_5/target/test-
> >> > ear-javaee_5-2.0-SNAPSHOT
> >> > [INFO] Could not find manifest file: /home/prasad/geronimo/trunk/
> >> > testsupport/test-deployment-javaee_5/test-ear-javaee_5/src/main/
> >> > application/META-INF/MANIFEST.MF - Generating one
> >> > [INFO] Building jar: /home/prasad/geronimo/trunk/testsupport/test-
> >> > deployment-javaee_5/test-ear-javaee_5/target/test-ear-javaee_5-2.0-
> >> > SNAPSHOT.ear
> >> > [INFO] [install:install]
> >> > [INFO] Installing /home/prasad/geronimo/trunk/testsupport/test-
> >> > deployment-javaee_5/test-ear-javaee_5/target/test-ear-javaee_5-2.0-
> >> > SNAPSHOT.ear to /home/prasad/.m2/repository/org/apache/geronimo/
> >> > testsupport/test-ear-javaee_5/2.0-SNAPSHOT/test-ear-javaee_5-2.0-
> >> > SNAPSHOT.ear
> >> > [INFO]
> >> >
> >> ---------------------------------------------------------------------
> >> -
> >> > ------
> >> > [INFO] Building Geronimo :: Modules
> >> > [INFO]    task-segment: [install]
> >> > [INFO]
> >> >
> >> ---------------------------------------------------------------------
> >> -
> >> > ------
> >> > [INFO] [tools:require-java-version {execution: validate-java-
> >> version}]
> >> > [INFO] [tools:copy-legal-files {execution: install-legal-files}]
> >> > [INFO] [site:attach-descriptor]
> >> > [INFO] [install:install]
> >> > [INFO] Installing /home/prasad/geronimo/trunk/modules/pom.xml to /
> >> > home/prasad/.m2/repository/org/apache/geronimo/modules/modules/2.0-
> >> > SNAPSHOT/modules-2.0-SNAPSHOT.pom
> >> > [INFO]
> >> >
> >> ---------------------------------------------------------------------
> >> -
> >> > ------
> >> > [INFO] Building Geronimo :: Activation
> >> > [INFO]    task-segment: [install]
> >> > [INFO]
> >> >
> >> ---------------------------------------------------------------------
> >> -
> >> > ------
> >> > [INFO] [tools:require-java-version {execution: validate-java-
> >> version}]
> >> > [INFO] [tools:copy-legal-files {execution: install-legal-files}]
> >> > [INFO] Created dir: /home/prasad/geronimo/trunk/modules/geronimo-
> >> > activation/target/classes/META-INF
> >> > [INFO] Copying 2 files to /home/prasad/geronimo/trunk/modules/
> >> > geronimo-activation/target/classes/META-INF
> >> > [INFO] [resources:resources]
> >> > [INFO] Using default encoding to copy filtered resources.
> >> > [INFO] snapshot org.apache.geronimo.specs:geronimo-
> >> > activation_1.1_spec:1.0-SNAPSHOT: checking for updates from apache-
> >> > snapshots
> >> > [INFO] snapshot org.apache.geronimo.specs:geronimo-
> >> > activation_1.1_spec:1.0-SNAPSHOT: checking for updates from axis2-
> >> > m2-repo
> >> > [INFO] snapshot org.apache.geronimo.specs:geronimo-
> >> > activation_1.1_spec:1.0-SNAPSHOT: checking for updates from
> >> > codehaus-snapshots
> >> > [INFO] snapshot org.apache.geronimo.specs:geronimo-
> >> > activation_1.1_spec:1.0-SNAPSHOT: checking for updates from
> >> > apache.snapshots
> >> > Downloading: http://people.apache.org/repo/m2-snapshot-repository/
> >> > org/apache/geronimo/specs/geronimo-activation_1.1_spec/1.0-
> >> SNAPSHOT/
> >> > geronimo-activation_1.1_spec-1.0-20061213.201610-3.pom
> >> > 452b downloaded
> >> > [INFO] snapshot org.apache.geronimo.javamail:geronimo-
> >> > javamail_1.4_mail:1.0-SNAPSHOT: checking for updates from apache-
> >> > snapshots
> >> > [INFO] snapshot org.apache.geronimo.javamail:geronimo-
> >> > javamail_1.4_mail:1.0-SNAPSHOT: checking for updates from axis2-m2-
> >> > repo
> >> > [INFO] snapshot org.apache.geronimo.javamail:geronimo-
> >> > javamail_1.4_mail:1.0-SNAPSHOT: checking for updates from codehaus-
> >> > snapshots
> >> > [INFO] snapshot org.apache.geronimo.javamail:geronimo-
> >> > javamail_1.4_mail:1.0-SNAPSHOT: checking for updates from
> >> > apache.snapshots
> >> > Downloading: http://people.apache.org/repo/m2-snapshot-repository/
> >> > org/apache/geronimo/javamail/geronimo-javamail_1.4_mail/1.0-
> >> > SNAPSHOT/geronimo-javamail_1.4_mail-1.0-20061213.042101-3.pom
> >> > 2K downloaded
> >> > [INFO] snapshot org.apache.geronimo.javamail:javamail:1.0-SNAPSHOT:
> >> > checking for updates from apache-snapshots
> >> > [INFO] snapshot org.apache.geronimo.javamail:javamail:1.0-SNAPSHOT:
> >> > checking for updates from axis2-m2-repo
> >> > [INFO] snapshot org.apache.geronimo.javamail:javamail:1.0-SNAPSHOT:
> >> > checking for updates from codehaus-snapshots
> >> > [INFO] snapshot org.apache.geronimo.javamail:javamail:1.0-SNAPSHOT:
> >> > checking for updates from apache.snapshots
> >> > Downloading: http://people.apache.org/repo/m2-snapshot-repository/
> >> > org/apache/geronimo/javamail/javamail/1.0-SNAPSHOT/
> >> > javamail-1.0-20061031.223401-5.pom
> >> > 6K downloaded
> >> > [INFO] snapshot org.apache.geronimo.javamail:geronimo-
> >> > javamail_1.4_provider:1.0-SNAPSHOT: checking for updates from
> >> > apache-snapshots
> >> > [INFO] snapshot org.apache.geronimo.javamail:geronimo-
> >> > javamail_1.4_provider:1.0-SNAPSHOT: checking for updates from
> >> axis2-
> >> > m2-repo
> >> > [INFO] snapshot org.apache.geronimo.javamail:geronimo-
> >> > javamail_1.4_provider:1.0-SNAPSHOT: checking for updates from
> >> > codehaus-snapshots
> >> > [INFO] snapshot org.apache.geronimo.javamail:geronimo-
> >> > javamail_1.4_provider:1.0-SNAPSHOT: checking for updates from
> >> > apache.snapshots
> >> > Downloading: http://people.apache.org/repo/m2-snapshot-repository/
> >> > org/apache/geronimo/javamail/geronimo-javamail_1.4_provider/1.0-
> >> > SNAPSHOT/geronimo-javamail_1.4_provider-1.0-20061213.042521-5.pom
> >> > 880b downloaded
> >> > [INFO] snapshot org.apache.geronimo.specs:geronimo-
> >> > javamail_1.4_spec:1.0-SNAPSHOT: checking for updates from apache-
> >> > snapshots
> >> > [INFO] snapshot org.apache.geronimo.specs:geronimo-
> >> > javamail_1.4_spec:1.0-SNAPSHOT: checking for updates from axis2-m2-
> >> > repo
> >> > [INFO] snapshot org.apache.geronimo.specs:geronimo-
> >> > javamail_1.4_spec:1.0-SNAPSHOT: checking for updates from codehaus-
> >> > snapshots
> >> > [INFO] snapshot org.apache.geronimo.specs:geronimo-
> >> > javamail_1.4_spec:1.0-SNAPSHOT: checking for updates from
> >> > apache.snapshots
> >> > Downloading: http://people.apache.org/repo/m2-snapshot-repository/
> >> > org/apache/geronimo/specs/geronimo-javamail_1.4_spec/1.0-SNAPSHOT/
> >> > geronimo-javamail_1.4_spec-1.0-20061213.201610-4.pom
> >> > 697b downloaded
> >> > Downloading: http://people.apache.org/repo/m2-snapshot-repository/
> >> > org/apache/geronimo/specs/geronimo-javamail_1.4_spec/1.0-SNAPSHOT/
> >> > geronimo-javamail_1.4_spec-1.0-20061213.201610-4.jar
> >> > 189K downloaded
> >> > Downloading: http://people.apache.org/repo/m2-snapshot-repository/
> >> > org/apache/geronimo/javamail/geronimo-javamail_1.4_mail/1.0-
> >> > SNAPSHOT/geronimo-javamail_1.4_mail-1.0-20061213.042101-3.jar
> >> > 297K downloaded
> >> > Downloading: http://people.apache.org/repo/m2-snapshot-repository/
> >> > org/apache/geronimo/javamail/geronimo-javamail_1.4_provider/1.0-
> >> > SNAPSHOT/geronimo-javamail_1.4_provider-1.0-20061213.042521-5.jar
> >> > 109K downloaded
> >> > Downloading: http://people.apache.org/repo/m2-snapshot-repository/
> >> > org/apache/geronimo/specs/geronimo-activation_1.1_spec/1.0-
> >> SNAPSHOT/
> >> > geronimo-activation_1.1_spec-1.0-20061213.201610-3.jar
> >> > 33K downloaded
> >> > [INFO] [compiler:compile]
> >> > Compiling 8 source files to /home/prasad/geronimo/trunk/modules/
> >> > geronimo-activation/target/classes
> >> > [INFO] [resources:testResources]
> >> > [INFO] Using default encoding to copy filtered resources.
> >> > Downloading: http://people.apache.org/repo/m2-snapshot-repository/
> >> > org/apache/geronimo/javamail/geronimo-javamail_1.4_mail/1.0-
> >> > SNAPSHOT/geronimo-javamail_1.4_mail-1.0-20061213.042101-3.pom
> >> > 2K downloaded
> >> > [INFO] [compiler:testCompile]
> >> > Compiling 4 source files to /home/prasad/geronimo/trunk/modules/
> >> > geronimo-activation/target/test-classes
> >> > [INFO] [surefire:test]
> >> > Downloading: http://repository.codehaus.org/org/codehaus/plexus/
> >> > plexus-utils/1.1/plexus-utils-1.1.jar
> >> > [WARNING] Unable to get resource from repository codehaus (http://
> >> > repository.codehaus.org)
> >> > Downloading: http://repo1.maven.org/maven2/org/codehaus/plexus/
> >> > plexus-utils/1.1/plexus-utils-1.1.jar
> >> > 164K downloaded
> >> > Downloading: http://repository.codehaus.org/org/apache/maven/
> >> > surefire/surefire-junit/2.0/surefire-junit-2.0.pom
> >> > [WARNING] Unable to get resource from repository codehaus (http://
> >> > repository.codehaus.org)
> >> > Downloading: http://repo1.maven.org/maven2/org/apache/maven/
> >> > surefire/surefire-junit/2.0/surefire-junit-2.0.pom
> >> > 583b downloaded
> >> > Downloading: http://repository.codehaus.org/org/apache/maven/
> >> > surefire/surefire-providers/2.0/surefire-providers-2.0.pom
> >> > [WARNING] Unable to get resource from repository codehaus (http://
> >> > repository.codehaus.org)
> >> > Downloading: http://repo1.maven.org/maven2/org/apache/maven/
> >> > surefire/surefire-providers/2.0/surefire-providers-2.0.pom
> >> > 1K downloaded
> >> > Downloading: http://repository.codehaus.org/org/apache/maven/
> >> > surefire/surefire-junit/2.0/surefire-junit-2.0.jar
> >> > [WARNING] Unable to get resource from repository codehaus (http://
> >> > repository.codehaus.org)
> >> > Downloading: http://repo1.maven.org/maven2/org/apache/maven/
> >> > surefire/surefire-junit/2.0/surefire-junit-2.0.jar
> >> > 11K downloaded
> >> > [INFO] Surefire report directory: /home/prasad/geronimo/trunk/
> >> > modules/geronimo-activation/target/surefire-reports
> >> > Warning: -enableassertions not understood. Ignoring.
> >> > org.apache.maven.surefire.booter.SurefireExecutionException: while
> >> > resolving class: org.apache.geronimo.testsupport.TestSupport;
> >> > nested exception is java.lang.NoClassDefFoundError: while resolving
> >> > class: org.apache.geronimo.testsupport.TestSupport
> >> > java.lang.NoClassDefFoundError: while resolving class:
> >> > org.apache.geronimo.testsupport.TestSupport
> >> >    at java.lang.VMClassLoader.resolveClass(java.lang.Class) (/usr/
> >> > lib/libgcj.so.5.0.0)
> >> >    at _Jv_PrepareClass(java.lang.Class) (/usr/lib/libgcj.so.5.0.0)
> >> >    at _Jv_WaitForState(java.lang.Class, int) (/usr/lib/libgcj.so.
> >> > 5.0.0)
> >> >    at java.lang.VMClassLoader.linkClass0(java.lang.Class) (/usr/
> >> lib/
> >> > libgcj.so.5.0.0)
> >> >    at java.lang.VMClassLoader.resolveClass(java.lang.Class) (/usr/
> >> > lib/libgcj.so.5.0.0)
> >> >    at _Jv_PrepareClass(java.lang.Class) (/usr/lib/libgcj.so.5.0.0)
> >> >    at _Jv_WaitForState(java.lang.Class, int) (/usr/lib/libgcj.so.
> >> > 5.0.0)
> >> >    at java.lang.VMClassLoader.linkClass0(java.lang.Class) (/usr/
> >> lib/
> >> > libgcj.so.5.0.0)
> >> >    at java.lang.VMClassLoader.resolveClass(java.lang.Class) (/usr/
> >> > lib/libgcj.so.5.0.0)
> >> >    at java.lang.Class.initializeClass() (/usr/lib/libgcj.so.5.0.0)
> >> >    at java.lang.Class.isAssignableFrom(java.lang.Class) (/usr/lib/
> >> > libgcj.so.5.0.0)
> >> >    at
> >> >
> >> org.apache.maven.surefire.junit.JUnitDirectoryTestSuite.createTestSet
> >> (
> >> > java.lang.Class, java.lang.ClassLoader) (Unknown Source)
> >> >    at
> >> >
> >> org.apache.maven.surefire.suite.AbstractDirectoryTestSuite.locateTest
> >> S
> >> > ets(java.lang.ClassLoader) (Unknown Source)
> >> >    at org.apache.maven.surefire.Surefire.createSuiteFromDefinition
> >> > (java.lang.Object[], java.lang.ClassLoader, java.lang.ClassLoader)
> >> > (Unknown Source)
> >> >    at org.apache.maven.surefire.Surefire.run(java.util.List,
> >> > java.util.List, java.lang.ClassLoader, java.lang.ClassLoader)
> >> > (Unknown Source)
> >> >    at _Jv_CallAnyMethodA(java.lang.Object, java.lang.Class,
> >> > _Jv_Method, boolean, boolean, java.lang.Class[], jvalue, jvalue,
> >> > boolean) (/usr/lib/libgcj.so.5.0.0)
> >> >    at _Jv_CallAnyMethodA(java.lang.Object, java.lang.Class,
> >> > _Jv_Method, boolean, java.lang.Class[], java.lang.Object[]) (/usr/
> >> > lib/libgcj.so.5.0.0)
> >> >    at java.lang.reflect.Method.invoke(java.lang.Object,
> >> > java.lang.Object[]) (/usr/lib/libgcj.so.5.0.0)
> >> >    at
> >> > org.apache.maven.surefire.booter.SurefireBooter.runSuitesInProcess
> >> > () (Unknown Source)
> >> >    at org.apache.maven.surefire.booter.SurefireBooter.main
> >> > (java.lang.String[]) (Unknown Source)
> >> > Caused by: java.lang.ClassNotFoundException:
> >> > java.lang.StringBuilder not found in [file:/home/prasad/geronimo/
> >> > trunk/modules/geronimo-activation/target/classes/, file:/home/
> >> > prasad/geronimo/trunk/modules/geronimo-activation/target/test-
> >> > classes/, file:/home/prasad/.m2/repository/org/apache/geronimo/
> >> > javamail/geronimo-javamail_1.4_provider/1.0-SNAPSHOT/geronimo-
> >> > javamail_1.4_provider-1.0-SNAPSHOT.jar, file:/home/prasad/.m2/
> >> > repository/junit/junit/3.8.1/junit-3.8.1.jar, file:/home/
> >> prasad/.m2/
> >> > repository/org/apache/geronimo/javamail/geronimo-javamail_1.4_mail/
> >> > 1.0-SNAPSHOT/geronimo-javamail_1.4_mail-1.0-SNAPSHOT.jar, file:/
> >> > home/prasad/.m2/repository/org/apache/geronimo/specs/geronimo-
> >> > javamail_1.4_spec/1.0-SNAPSHOT/geronimo-javamail_1.4_spec-1.0-
> >> > SNAPSHOT.jar, file:/home/prasad/.m2/repository/xmlbeans/xbean/
> >> 2.0.0/
> >> > xbean-2.0.0.jar, file:/home/prasad/.m2/repository/commons-logging/
> >> > commons-logging/1.0.4/commons-logging-1.0.4.jar, file:/home/
> >> > prasad/.m2/repository/org/apache/geronimo/specs/gero
> >> >  nimo-activation_1.1_spec/1.0-SNAPSHOT/geronimo-
> >> > activation_1.1_spec-1.0-SNAPSHOT.jar, file:/home/prasad/.m2/
> >> > repository/org/apache/geronimo/genesis/config/logging-config/1.1/
> >> > logging-config-1.1.jar, file:/home/prasad/.m2/repository/stax/stax-
> >> > api/1.0.1/stax-api-1.0.1.jar, file:/home/prasad/.m2/repository/
> >> > log4j/log4j/1.2.14/log4j-1.2.14.jar, file:/home/prasad/geronimo/
> >> > trunk/testsupport/testsupport-common/target/testsupport-common-2.0-
> >> > SNAPSHOT.jar]
> >> >    at java.net.URLClassLoader.findClass(java.lang.String) (/usr/
> >> lib/
> >> > libgcj.so.5.0.0)
> >> >    at java.lang.ClassLoader.loadClass(java.lang.String, boolean) (/
> >> > usr/lib/libgcj.so.5.0.0)
> >> >    at _Jv_FindClass(_Jv_Utf8Const, java.lang.ClassLoader) (/usr/
> >> lib/
> >> > libgcj.so.5.0.0)
> >> >    at java.lang.Class.forName(java.lang.String, boolean,
> >> > java.lang.ClassLoader) (/usr/lib/libgcj.so.5.0.0)
> >> >    at _Jv_BytecodeVerifier.verify_instructions_0() (/usr/lib/
> >> > libgcj.so.5.0.0)
> >> >    at _Jv_VerifyMethod(_Jv_InterpMethod) (/usr/lib/libgcj.so.5.0.0)
> >> >    at _Jv_PrepareClass(java.lang.Class) (/usr/lib/libgcj.so.5.0.0)
> >> >    at _Jv_WaitForState(java.lang.Class, int) (/usr/lib/libgcj.so.
> >> > 5.0.0)
> >> >    at java.lang.VMClassLoader.linkClass0(java.lang.Class) (/usr/
> >> lib/
> >> > libgcj.so.5.0.0)
> >> >    at java.lang.VMClassLoader.resolveClass(java.lang.Class) (/usr/
> >> > lib/libgcj.so.5.0.0)
> >> >    ...19 more
> >> > [INFO]
> >> >
> >> ---------------------------------------------------------------------
> >> -
> >> > --
> >> > [ERROR] BUILD FAILURE
> >> > [INFO]
> >> >
> >> ---------------------------------------------------------------------
> >> -
> >> > --
> >> > [INFO] There are test failures.
> >> > [INFO]
> >> >
> >> ---------------------------------------------------------------------
> >> -
> >> > --
> >> > [INFO] For more information, run Maven with the -e switch
> >> > [INFO]
> >> >
> >> ---------------------------------------------------------------------
> >> -
> >> > --
> >> > [INFO] Total time: 2 minutes 23 seconds
> >> > [INFO] Finished at: Sun Feb 11 05:04:17 EST 2007
> >> > [INFO] Final Memory: 51M/146M
> >> > [INFO]
> >> >
> >> ---------------------------------------------------------------------
> >> -
> >> > --
> >>
> >>
>
>

Mime
View raw message