geronimo-dev mailing list archives

Site index · List index
Message view « Date » · « Thread »
Top « Date » · « Thread »
From Lin Sun <linsun....@gmail.com>
Subject Re: M3 Build Error: Axis2 tests
Date Mon, 26 Feb 2007 16:07:10 GMT
Worked for me with the latest trunk and some local modification about to 
be attached as a patch (tho I don't think the modification made a 
difference).

-------------------------------------------------------
  T E S T S
-------------------------------------------------------
Running org.apache.geronimo.axis2.Axis2HandlerResolverTest
Tests run: 5, Failures: 0, Errors: 0, Skipped: 0, Time elapsed: 1.578 sec
Running org.apache.geronimo.axis2.Axis2WebServiceContainerTest
Tests run: 3, Failures: 0, Errors: 0, Skipped: 0, Time elapsed: 1.563 sec

Results :
Tests run: 8, Failures: 0, Errors: 0, Skipped: 0

Lin
Davanum Srinivas wrote:
> Can you please post the surefire logs?
> 
> thanks,
> dims
> 
> On 2/26/07, Sachin Patel <sppatel2@gmail.com> wrote:
>>
>> -------------------------------------------------------
>>  T E S T S
>> -------------------------------------------------------
>> Running org.apache.geronimo.axis2.Axis2HandlerResolverTest
>> Tests run: 5, Failures: 0, Errors: 5, Skipped: 0, Time elapsed: 0.081 sec
>> <<< FAILURE!
>> Running
>> org.apache.geronimo.axis2.Axis2WebServiceContainerTest
>> Tests run: 3, Failures: 0, Errors: 1, Skipped: 0, Time elapsed: 0.242 sec
>> <<< FAILURE!
>>
>> Results :
>> Tests run: 8, Failures: 0, Errors: 6, Skipped: 0
>>
>> [INFO]
>> ------------------------------------------------------------------------
>> [ERROR] BUILD FAILURE
>> [INFO]
>> ------------------------------------------------------------------------
>> [INFO] There are test failures.
>> [INFO]
>> ------------------------------------------------------------------------
>> [INFO] For more information, run Maven with the -e switch
>> [INFO]
>> ------------------------------------------------------------------------
>> [INFO] Total time: 6 minutes 42 seconds
>> [INFO] Finished at: Mon Feb 26 08:16:02 EST 2007
>> [INFO] Final Memory: 87M/508M
>> [INFO]
>> ------------------------------------------------------------------------
>>
>> -sachin
>>
>>
> 
> 


Mime
View raw message