geronimo-dev mailing list archives

Site index · List index
Message view « Date » · « Thread »
Top « Date » · « Thread »
From pra...@apache.org
Subject [BUILD] TRUNK: Failed for Revision: 511768
Date Mon, 26 Feb 2007 10:22:35 GMT
Building with Maven version: 2.0.5
Revision: 511768 built with tests included
See the full build-0500.log file at http://people.apache.org/~prasad/binaries/20070226/build-0500.log
 
242K downloaded
Downloading: http://people.apache.org/repo/m2-snapshot-repository/org/apache/axis2/axis2-metadata/SNAPSHOT/axis2-metadata-20070226.010128-22.jar
331K downloaded
Downloading: http://tomcat.apache.org/dev/dist/m2-repository//commons-fileupload/commons-fileupload/1.1.1/commons-fileupload-1.1.1.jar
[WARNING] Unable to get resource 'commons-fileupload:commons-fileupload:jar:1.1.1' from repository
tomcat-m2-repo (http://tomcat.apache.org/dev/dist/m2-repository/)
Downloading: http://ws.zones.apache.org/repository2//commons-fileupload/commons-fileupload/1.1.1/commons-fileupload-1.1.1.jar
[WARNING] Unable to get resource 'commons-fileupload:commons-fileupload:jar:1.1.1' from repository
axis2-m2-repo (http://ws.zones.apache.org/repository2/)
Downloading: http://people.apache.org/repo/m2-incubating-repository//commons-fileupload/commons-fileupload/1.1.1/commons-fileupload-1.1.1.jar
[WARNING] Unable to get resource 'commons-fileupload:commons-fileupload:jar:1.1.1' from repository
apache-incubator (http://people.apache.org/repo/m2-incubating-repository/)
Downloading: http://repository.codehaus.org/commons-fileupload/commons-fileupload/1.1.1/commons-fileupload-1.1.1.jar
[WARNING] Unable to get resource 'commons-fileupload:commons-fileupload:jar:1.1.1' from repository
codehaus (http://repository.codehaus.org)
Downloading: http://ws.zones.apache.org/repository2//commons-fileupload/commons-fileupload/1.1.1/commons-fileupload-1.1.1.jar
[WARNING] Unable to get resource 'commons-fileupload:commons-fileupload:jar:1.1.1' from repository
apache-ws-snapshots2 (http://ws.zones.apache.org/repository2/)
Downloading: http://repo1.maven.org/maven2//commons-fileupload/commons-fileupload/1.1.1/commons-fileupload-1.1.1.jar
31K downloaded
Downloading: http://people.apache.org/repo/m2-snapshot-repository/org/apache/axis2/axis2-java2wsdl/SNAPSHOT/axis2-java2wsdl-20070226.070055-38.jar
53K downloaded
Downloading: http://tomcat.apache.org/dev/dist/m2-repository//org/apache/httpcomponents/jakarta-httpcore/4.0-alpha3/jakarta-httpcore-4.0-alpha3.jar
[WARNING] Unable to get resource 'org.apache.httpcomponents:jakarta-httpcore:jar:4.0-alpha3'
from repository tomcat-m2-repo (http://tomcat.apache.org/dev/dist/m2-repository/)
Downloading: http://ws.zones.apache.org/repository2//org/apache/httpcomponents/jakarta-httpcore/4.0-alpha3/jakarta-httpcore-4.0-alpha3.jar
[WARNING] Unable to get resource 'org.apache.httpcomponents:jakarta-httpcore:jar:4.0-alpha3'
from repository axis2-m2-repo (http://ws.zones.apache.org/repository2/)
Downloading: http://people.apache.org/repo/m2-incubating-repository//org/apache/httpcomponents/jakarta-httpcore/4.0-alpha3/jakarta-httpcore-4.0-alpha3.jar
[WARNING] Unable to get resource 'org.apache.httpcomponents:jakarta-httpcore:jar:4.0-alpha3'
from repository apache-incubator (http://people.apache.org/repo/m2-incubating-repository/)
Downloading: http://repository.codehaus.org/org/apache/httpcomponents/jakarta-httpcore/4.0-alpha3/jakarta-httpcore-4.0-alpha3.jar
[WARNING] Unable to get resource 'org.apache.httpcomponents:jakarta-httpcore:jar:4.0-alpha3'
from repository codehaus (http://repository.codehaus.org)
Downloading: http://ws.zones.apache.org/repository2//org/apache/httpcomponents/jakarta-httpcore/4.0-alpha3/jakarta-httpcore-4.0-alpha3.jar
[WARNING] Unable to get resource 'org.apache.httpcomponents:jakarta-httpcore:jar:4.0-alpha3'
from repository apache-ws-snapshots2 (http://ws.zones.apache.org/repository2/)
Downloading: http://repo1.maven.org/maven2//org/apache/httpcomponents/jakarta-httpcore/4.0-alpha3/jakarta-httpcore-4.0-alpha3.jar
125K downloaded
Downloading: http://people.apache.org/repo/m2-snapshot-repository/org/apache/axis2/axis2-jaxws/SNAPSHOT/axis2-jaxws-20070226.010128-8.jar
348K downloaded
Downloading: http://tomcat.apache.org/dev/dist/m2-repository//xerces/xmlParserAPIs/2.6.0/xmlParserAPIs-2.6.0.jar
[WARNING] Unable to get resource 'xerces:xmlParserAPIs:jar:2.6.0' from repository tomcat-m2-repo
(http://tomcat.apache.org/dev/dist/m2-repository/)
Downloading: http://ws.zones.apache.org/repository2//xerces/xmlParserAPIs/2.6.0/xmlParserAPIs-2.6.0.jar
[WARNING] Unable to get resource 'xerces:xmlParserAPIs:jar:2.6.0' from repository axis2-m2-repo
(http://ws.zones.apache.org/repository2/)
Downloading: http://people.apache.org/repo/m2-incubating-repository//xerces/xmlParserAPIs/2.6.0/xmlParserAPIs-2.6.0.jar
[WARNING] Unable to get resource 'xerces:xmlParserAPIs:jar:2.6.0' from repository apache-incubator
(http://people.apache.org/repo/m2-incubating-repository/)
Downloading: http://repository.codehaus.org/xerces/xmlParserAPIs/2.6.0/xmlParserAPIs-2.6.0.jar
[WARNING] Unable to get resource 'xerces:xmlParserAPIs:jar:2.6.0' from repository codehaus
(http://repository.codehaus.org)
Downloading: http://repo1.maven.org/maven2/xerces/xmlParserAPIs/2.6.0/xmlParserAPIs-2.6.0.jar
121K downloaded
Downloading: http://people.apache.org/repo/m2-snapshot-repository/org/apache/ws/commons/schema/XmlSchema/SNAPSHOT/XmlSchema-20070225.213643-12.jar
123K downloaded
Downloading: http://tomcat.apache.org/dev/dist/m2-repository//org/apache/ant/ant-launcher/1.7.0/ant-launcher-1.7.0.jar
[WARNING] Unable to get resource 'org.apache.ant:ant-launcher:jar:1.7.0' from repository tomcat-m2-repo
(http://tomcat.apache.org/dev/dist/m2-repository/)
Downloading: http://ws.zones.apache.org/repository2//org/apache/ant/ant-launcher/1.7.0/ant-launcher-1.7.0.jar
[WARNING] Unable to get resource 'org.apache.ant:ant-launcher:jar:1.7.0' from repository axis2-m2-repo
(http://ws.zones.apache.org/repository2/)
Downloading: http://people.apache.org/repo/m2-incubating-repository//org/apache/ant/ant-launcher/1.7.0/ant-launcher-1.7.0.jar
[WARNING] Unable to get resource 'org.apache.ant:ant-launcher:jar:1.7.0' from repository apache-incubator
(http://people.apache.org/repo/m2-incubating-repository/)
Downloading: http://repository.codehaus.org/org/apache/ant/ant-launcher/1.7.0/ant-launcher-1.7.0.jar
[WARNING] Unable to get resource 'org.apache.ant:ant-launcher:jar:1.7.0' from repository codehaus
(http://repository.codehaus.org)
Downloading: http://repo1.maven.org/maven2/org/apache/ant/ant-launcher/1.7.0/ant-launcher-1.7.0.jar
11K downloaded
[INFO] [compiler:compile]
[INFO] Compiling 77 source files to /home/prasad/geronimo/trunk/modules/geronimo-axis2/target/classes
Downloading: http://tomcat.apache.org/dev/dist/m2-repository//org/apache/axis2/axis2-jaxws/20070226.010128-8/axis2-jaxws-20070226.010128-8.pom
[WARNING] Unable to get resource 'org.apache.axis2:axis2-jaxws:pom:20070226.010128-8' from
repository tomcat-m2-repo (http://tomcat.apache.org/dev/dist/m2-repository/)
Downloading: http://ws.zones.apache.org/repository2//org/apache/axis2/axis2-jaxws/20070226.010128-8/axis2-jaxws-20070226.010128-8.pom
[WARNING] Unable to get resource 'org.apache.axis2:axis2-jaxws:pom:20070226.010128-8' from
repository axis2-m2-repo (http://ws.zones.apache.org/repository2/)
Downloading: http://people.apache.org/repo/m2-incubating-repository//org/apache/axis2/axis2-jaxws/20070226.010128-8/axis2-jaxws-20070226.010128-8.pom
[WARNING] Unable to get resource 'org.apache.axis2:axis2-jaxws:pom:20070226.010128-8' from
repository apache-incubator (http://people.apache.org/repo/m2-incubating-repository/)
Downloading: http://repository.codehaus.org/org/apache/axis2/axis2-jaxws/20070226.010128-8/axis2-jaxws-20070226.010128-8.pom
[WARNING] Unable to get resource 'org.apache.axis2:axis2-jaxws:pom:20070226.010128-8' from
repository codehaus (http://repository.codehaus.org)
Downloading: http://repo1.maven.org/maven2/org/apache/axis2/axis2-jaxws/20070226.010128-8/axis2-jaxws-20070226.010128-8.pom
[WARNING] Unable to get resource 'org.apache.axis2:axis2-jaxws:pom:20070226.010128-8' from
repository central (http://repo1.maven.org/maven2)
[INFO] [antrun:run {execution: generate-test-sources}]
[INFO] Executing tasks
     [echo] Generating java from test_service_doc_lit.wsdl
    [mkdir] Created dir: /home/prasad/geronimo/trunk/modules/geronimo-axis2/target/schema/src
     [java] Exception in thread "main" java.lang.NoClassDefFoundError: com/sun/tools/xjc/Driver
[INFO] Executed tasks
[INFO] [resources:testResources]
[INFO] Using default encoding to copy filtered resources.
[INFO] [compiler:testCompile]
[INFO] Compiling 7 source files to /home/prasad/geronimo/trunk/modules/geronimo-axis2/target/test-classes
[INFO] [surefire:test]
[INFO] Surefire report directory: /home/prasad/geronimo/trunk/modules/geronimo-axis2/target/surefire-reports

-------------------------------------------------------
 T E S T S
-------------------------------------------------------
Running org.apache.geronimo.axis2.Axis2HandlerResolverTest
Tests run: 5, Failures: 0, Errors: 5, Skipped: 0, Time elapsed: 0.11 sec <<< FAILURE!
Running org.apache.geronimo.axis2.Axis2WebServiceContainerTest
Tests run: 3, Failures: 0, Errors: 1, Skipped: 0, Time elapsed: 0.232 sec <<< FAILURE!

Results :
Tests run: 8, Failures: 0, Errors: 6, Skipped: 0

[INFO] ------------------------------------------------------------------------
[ERROR] BUILD FAILURE
[INFO] ------------------------------------------------------------------------
[INFO] There are test failures.
[INFO] ------------------------------------------------------------------------
[INFO] For more information, run Maven with the -e switch
[INFO] ------------------------------------------------------------------------
[INFO] Total time: 16 minutes 58 seconds
[INFO] Finished at: Mon Feb 26 05:23:59 EST 2007
[INFO] Final Memory: 70M/976M
[INFO] ------------------------------------------------------------------------

Mime
View raw message