geronimo-dev mailing list archives

Site index · List index
Message view « Date » · « Thread »
Top « Date » · « Thread »
From Jason Dillon <ja...@planet57.com>
Subject Re: Geronimo :: Configuration Converter build error....
Date Wed, 28 Feb 2007 03:23:56 GMT
No idea what happened here... might have been a corrupt svn co... I  
didn't know that was possible :-(

--jason


On Feb 27, 2007, at 5:05 PM, Jason Dillon wrote:

> <snip>
> [INFO]  
> ---------------------------------------------------------------------- 
> ------
> [INFO] Building Geronimo :: Configuration Converter
> [INFO]    task-segment: [install]
> [INFO]  
> ---------------------------------------------------------------------- 
> ------
> [INFO] [tools:require-java-version {execution: validate-java-version}]
> [INFO] [tools:copy-legal-files {execution: install-legal-files}]
> [INFO] Created dir: /home/anthill/anthill3/agent/var/jobs/projects/ 
> Geronimo_Components/build_trunk/project/modules/geronimo-converter/ 
> target/classes/META-INF
> [INFO] Copying 2 files to /home/anthill/anthill3/agent/var/jobs/ 
> projects/Geronimo_Components/build_trunk/project/modules/geronimo- 
> converter/target/classes/META-INF
> [INFO] [resources:resources]
> [INFO] Using default encoding to copy filtered resources.
> [INFO] [compiler:compile]
> [INFO] Compiling 8 source files to /home/anthill/anthill3/agent/var/ 
> jobs/projects/Geronimo_Components/build_trunk/project/modules/ 
> geronimo-converter/target/classes
> [INFO]  
> ---------------------------------------------------------------------- 
> --
> [ERROR] BUILD FAILURE
> [INFO]  
> ---------------------------------------------------------------------- 
> --
> [INFO] Compilation failure
> /home/anthill/anthill3/agent/var/jobs/projects/Geronimo_Components/ 
> build_trunk/project/modules/geronimo-converter/src/main/java/org/ 
> apache/geronimo/converter/AbstractDatabasePool.java:[63,8] cannot  
> find symbol
> symbol  : variable newCknnectionSQL
> location: class org.apache.geronimo.converter.AbstractDatabasePool
>
>
>
> /home/anthill/anthill3/agent/var/jobs/projects/Geronimo_Components/ 
> build_trunk/project/modules/geronimo-converter/src/main/java/org/ 
> apache/geronimo/converter/AbstractDatabasePool.java:[63,8] cannot  
> find symbol
> symbol  : variable newCknnectionSQL
> location: class org.apache.geronimo.converter.AbstractDatabasePool
>
>
> [INFO]  
> ---------------------------------------------------------------------- 
> --
> [INFO] Trace
> org.apache.maven.BuildFailureException: Compilation failure
> /home/anthill/anthill3/agent/var/jobs/projects/Geronimo_Components/ 
> build_trunk/project/modules/geronimo-converter/src/main/java/org/ 
> apache/geronimo/converter/AbstractDatabasePool.java:[63,8] cannot  
> find symbol
> symbol  : variable newCknnectionSQL
> location: class org.apache.geronimo.converter.AbstractDatabasePool
>
>
> 	at org.apache.maven.lifecycle.DefaultLifecycleExecutor.executeGoals 
> (DefaultLifecycleExecutor.java:560)
> 	at  
> org.apache.maven.lifecycle.DefaultLifecycleExecutor.executeGoalWithLif 
> ecycle(DefaultLifecycleExecutor.java:480)
> 	at org.apache.maven.lifecycle.DefaultLifecycleExecutor.executeGoal 
> (DefaultLifecycleExecutor.java:459)
> 	at  
> org.apache.maven.lifecycle.DefaultLifecycleExecutor.executeGoalAndHand 
> leFailures(DefaultLifecycleExecutor.java:311)
> 	at  
> org.apache.maven.lifecycle.DefaultLifecycleExecutor.executeTaskSegment 
> s(DefaultLifecycleExecutor.java:278)
> 	at org.apache.maven.lifecycle.DefaultLifecycleExecutor.execute 
> (DefaultLifecycleExecutor.java:143)
> 	at org.apache.maven.DefaultMaven.doExecute(DefaultMaven.java:330)
> 	at org.apache.maven.DefaultMaven.execute(DefaultMaven.java:123)
> 	at org.apache.maven.cli.MavenCli.main(MavenCli.java:272)
> 	at sun.reflect.NativeMethodAccessorImpl.invoke0(Native Method)
> 	at sun.reflect.NativeMethodAccessorImpl.invoke 
> (NativeMethodAccessorImpl.java:39)
> 	at sun.reflect.DelegatingMethodAccessorImpl.invoke 
> (DelegatingMethodAccessorImpl.java:25)
> 	at java.lang.reflect.Method.invoke(Method.java:585)
> 	at org.codehaus.classworlds.Launcher.launchEnhanced(Launcher.java: 
> 315)
> 	at org.codehaus.classworlds.Launcher.launch(Launcher.java:255)
> 	at org.codehaus.classworlds.Launcher.mainWithExitCode 
> (Launcher.java:430)
> 	at org.codehaus.classworlds.Launcher.main(Launcher.java:375)
> Caused by: org.apache.maven.plugin.CompilationFailureException:  
> Compilation failure
> /home/anthill/anthill3/agent/var/jobs/projects/Geronimo_Components/ 
> build_trunk/project/modules/geronimo-converter/src/main/java/org/ 
> apache/geronimo/converter/AbstractDatabasePool.java:[63,8] cannot  
> find symbol
> symbol  : variable newCknnectionSQL
> location: class org.apache.geronimo.converter.AbstractDatabasePool
>
>
> 	at org.apache.maven.plugin.AbstractCompilerMojo.execute 
> (AbstractCompilerMojo.java:516)
> 	at org.apache.maven.plugin.CompilerMojo.execute(CompilerMojo.java: 
> 114)
> 	at org.apache.maven.plugin.DefaultPluginManager.executeMojo 
> (DefaultPluginManager.java:420)
> 	at org.apache.maven.lifecycle.DefaultLifecycleExecutor.executeGoals 
> (DefaultLifecycleExecutor.java:539)
> 	... 16 more
> [INFO]  
> ---------------------------------------------------------------------- 
> --
> [INFO] Total time: 9 minutes 19 seconds
> [INFO] Finished at: Tue Feb 27 17:03:01 PST 2007
> [INFO] Final Memory: 41M/93M
> [INFO]  
> ---------------------------------------------------------------------- 
> --
> </snip>


Mime
View raw message