geronimo-dev mailing list archives

Site index · List index
Message view « Date » · « Thread »
Top « Date » · « Thread »
From anita kulshreshtha <a_kuls...@yahoo.com>
Subject Test Failure in opeejb-builder
Date Fri, 19 Jan 2007 17:40:06 GMT
  I am seeing this in openejb-builder rev 497879, win XP:

Thanks
Anita

-------------------------------------------------------------------------------
Test set: org.apache.geronimo.openejb.deployment.EjbModuleBuilderTest
-------------------------------------------------------------------------------
Tests run: 1, Failures: 0, Errors: 1, Skipped: 0, Time elapsed: 4.907
sec <<< FAILURE!
test(org.apache.geronimo.openejb.deployment.EjbModuleBuilderTest)  Time
elapsed: 4.844 sec  <<< ERROR!
org.apache.openejb.OpenEJBException: Error building bean
'BasicCmp2Bean'.  Exception: class org.apache.openejb.OpenEJBException:
CMP 2.x implementation class not found
org.apache.openejb.test.entity.cmp.BasicCmp2Bean_JPA: CMP 2.x
implementation class not found
org.apache.openejb.test.entity.cmp.BasicCmp2Bean_JPA
	at
org.apache.openejb.assembler.classic.EjbJarBuilder.build(EjbJarBuilder.java:61)
	at
org.apache.openejb.assembler.classic.Assembler.createApplication(Assembler.java:318)
	at
org.apache.openejb.assembler.classic.Assembler.createEjbJar(Assembler.java:276)
	at
org.apache.geronimo.openejb.OpenEjbSystemGBean.createEjbJar(OpenEjbSystemGBean.java:155)
	at org.apache.geronimo.openejb.deployment.EjbModuleBuilderTest.test(EjbModuleBuilderTest.java:69)


 
____________________________________________________________________________________
Want to start your own business?
Learn how on Yahoo! Small Business.
http://smallbusiness.yahoo.com/r-index

Mime
View raw message