geronimo-dev mailing list archives

Site index · List index
Message view « Date » · « Thread »
Top « Date » · « Thread »
From Joe Bohn <joe.b...@earthlink.net>
Subject windows build failure
Date Wed, 24 Jan 2007 14:58:21 GMT
I think the problem that Hernan reported last week building on Windows 
is still alive and well.  It doesn't seem to cause any problems on OSX.

I was hitting it yesterday and just hit it again today with the 2.0-M2 
branch, rev. 499407.


It seems to me that there is something fishy with the 
container-3.0-incubating-SNAPSHOT.pom that only seems to cause grief on 
windows (see the messages below between the "*******" lines I inserted 
where there is an error reading and error in opening the zip file).


This results in some strange entries in my local repo for the openejb 
container:

+---3.0-incubating-20070123.025044-17
|       container-3.0-incubating-20070123.025044-17.pom
|       container-3.0-incubating-20070123.025044-17.pom.sha1
|
\---3.0-incubating-SNAPSHOT
         container-3.0-incubating-SNAPSHOT.pom


Deleting these time-stamp entries and running again doesn't seem to 
avoid the problem.   This is building with a completely empty repo and 
clean %tmp% with a fresh checkout.   I've recreated on 2 different 
machines.   I think something is screwed up with the pom or 
maven-metadata but I'm not up on maven enough to know what it is.




[INFO] 
----------------------------------------------------------------------------
[INFO] Building Geronimo :: OpenEJB :: Builder
[INFO]    task-segment: [clean, install]
[INFO] 
----------------------------------------------------------------------------
[INFO] [clean:clean]
[INFO] Deleting directory 
C:\geronimo2.0-M2\modules\geronimo-openejb-builder\target
[INFO] Deleting directory 
C:\geronimo2.0-M2\modules\geronimo-openejb-builder\target\classes
[INFO] Deleting directory 
C:\geronimo2.0-M2\modules\geronimo-openejb-builder\target\test-classes
[INFO] [tools:require-java-version {execution: validate-java-version}]
Downloading: 
http://tomcat.apache.org/dev/dist/m2-repository//org/apache/geronimo/specs/geronimo-ejb_3.0_spec/1.0-M1/geronimo-ejb_3.0_spec-1.0-M1.jar
[WARNING] Unable to get resource from repository tomcat-m2-repo 
(http://tomcat.apache.org/dev/dist/m2-repository/)
Downloading: 
http://people.apache.org/repo/m2-incubating-repository//org/apache/geronimo/specs/geronimo-ejb_3.0_spec/1.0-M1/geronimo-ejb_3.0_spec-1.0-M1.jar
[WARNING] Unable to get resource from repository apache-incubator 
(http://people.apache.org/repo/m2-incubating-repository/)
Downloading: 
http://repository.codehaus.org/org/apache/geronimo/specs/geronimo-ejb_3.0_spec/1.0-M1/geronimo-ejb_3.0_spec-1.0-M1.jar
[WARNING] Unable to get resource from repository codehaus 
(http://repository.codehaus.org)
Downloading: 
http://people.apache.org/repo/m2-incubating-repository/org/apache/geronimo/specs/geronimo-ejb_3.0_spec/1.0-M1/geronimo-ejb_3.0_spec-1.0-M1.jar
[WARNING] Unable to get resource from repository 
apache-incubating-repository 
(http://people.apache.org/repo/m2-incubating-repository)
Downloading: 
http://repo1.maven.org/maven2/org/apache/geronimo/specs/geronimo-ejb_3.0_spec/1.0-M1/geronimo-ejb_3.0_spec-1.0-M1.jar
31K downloaded
[INFO] [xmlbeans:xmlbeans {execution: default}]
Time to build schema type system: 0.156 seconds
Time to generate code: 0.125 seconds

*******

error: error reading 
c:\m2repo\org\apache\openejb\container\3.0-incubating-SNAPSHOT\container-3.0-incubating-SNAPSHOT.pom;

error in opening zip file
Note: Some input files use or override a deprecated API.
Note: Recompile with -Xlint:deprecation for details.
1 error

*******


BUILD FAILED
[INFO] 
------------------------------------------------------------------------
[ERROR] BUILD ERROR
[INFO] 
------------------------------------------------------------------------
[INFO] XmlBeans compile failed:
  xml ErrorLoading schema file 
C:\geronimo2.0-M2\modules\geronimo-openejb-builder\src\main\schema\geronimo-openejb-2.0.xsd
xml ErrorLoading config file 
C:\geronimo2.0-M2\modules\geronimo-openejb-builder\src\main\schema\xmlconfig.xml

[INFO] 
------------------------------------------------------------------------
[INFO] For more information, run Maven with the -e switch
[INFO] 
------------------------------------------------------------------------
[INFO] Total time: 12 minutes 20 seconds
[INFO] Finished at: Wed Jan 24 09:26:39 EST 2007
[INFO] Final Memory: 62M/116M
[INFO] 
------------------------------------------------------------------------

Mime
View raw message