geronimo-dev mailing list archives

Site index · List index
Message view « Date » · « Thread »
Top « Date » · « Thread »
From Jason Dillon <ja...@planet57.com>
Subject OpenEJB 2 test failures
Date Wed, 29 Nov 2006 03:56:04 GMT
OpenEJB 2 (2.2 or 2.3) will not build due to test failures in  
"OpenEJB :: Builder":

<snip>
Tests run: 6, Failures: 0, Errors: 6, Skipped: 0, Time elapsed: 0.434  
sec <<< FAILURE!
Running org.apache.openejb.deployment.ant.OpenejbJarLocationTest
Tests run: 5, Failures: 0, Errors: 0, Skipped: 0, Time elapsed: 0.057  
sec
Running org.apache.openejb.deployment.EjbJarModuleDeploymentTest
Tests run: 1, Failures: 0, Errors: 1, Skipped: 0, Time elapsed: 0.007  
sec <<< FAILURE!
Running  
org.apache.openejb.deployment.entity.cmp.cmr.onetomany.OneToManyTest
Tests run: 10, Failures: 0, Errors: 10, Skipped: 0, Time elapsed:  
0.045 sec <<< FAILURE!
Running org.apache.openejb.deployment.slsb.StatelessClientContainerTest
Tests run: 7, Failures: 0, Errors: 0, Skipped: 0, Time elapsed: 0.093  
sec
Running org.apache.openejb.deployment.UnpackedModuleDeploymentTest
Tests run: 1, Failures: 0, Errors: 1, Skipped: 0, Time elapsed: 0.019  
sec <<< FAILURE!
Running org.apache.openejb.deployment.ant.EjbJarLocationTest
Tests run: 3, Failures: 0, Errors: 0, Skipped: 0, Time elapsed: 0.01 sec
Running org.apache.openejb.deployment.TransactionPolicyHelperTest
Tests run: 5, Failures: 0, Errors: 0, Skipped: 0, Time elapsed: 0.035  
sec
Running org.apache.openejb.transaction.ContainerPolicyTest
Tests run: 2, Failures: 0, Errors: 0, Skipped: 0, Time elapsed: 0.016  
sec
Running  
org.apache.openejb.deployment.entity.cmp.cmr.onetomany.OneToManyCascadeD 
eleteTest
Tests run: 1, Failures: 0, Errors: 1, Skipped: 0, Time elapsed: 0.012  
sec <<< FAILURE!
</snip>

It would be really nice if someone could get this fixed... as G is  
stuck in the water until these pass.

--jason

Mime
View raw message