geronimo-dev mailing list archives

Site index · List index
Message view « Date » · « Thread »
Top « Date » · « Thread »
From "Kanchana Welagedara" <kancha...@gmail.com>
Subject Re: Do we need separate doc for bootstrap process?
Date Fri, 29 Sep 2006 11:39:11 GMT
So .I'll remove the stuff .Thanks for your ideas.

Regards
Kanchana

On 9/29/06, Jason Dillon <jason@planet57.com> wrote:
>
> bootstrap with jdk 1.4 should work fine now (no need for jdk 1.5 to
> build specs anymore).
>
> --jason
>
>
> On Sep 28, 2006, at 10:40 PM, Kanchana Welagedara wrote:
>
> > Hi Jay
> >
> > I have added a children
> > page(http://cwiki.apache.org/GMOxDEV/first-time-building-the-source-
> > code-step-by-step-bootstrap.html)
> > to Build Apache Geronimo with Maven 2.The idea to add this page was
> > there were many mails on the mailing list about this build recent
> > failure and we got repeated problems in the mailing list regarding the
> > boostrap build process with different version of JVM(you need both 1.4
> > and 1.5 ).
> >
> > (If this problem is temporary we don't need this document)
> >
> > In Build Apache Geronimo with Maven 2 document the boostraps build
> > process has come as a sub topic and As a new user you will find the
> > bootstrap build process steps in the middle of the document.I felt at
> > the first build user will not direct correct to the follow the
> > bootstrap process.So I added " first time build the code document"
> > page though I feel there are some common details in both.
> >
> > Basically I wanted to provide a clear steps to build the code first
> > time for new user.But if you feel this document is not necessary
> > ,please remove it or else I can improve the document further.
> >
> > Please kindly discuss the matter.
> >
> > Thanks and Regards
> > Kanchana
> > ---------- Forwarded message ----------
> > From: "Jay D. McHugh" <jay@joyfulnoisewebdesign.com>
> > Date: Tue, 26 Sep 2006 09:19:15 -0500
> > Subject: Re: Build Failure
> > To: user@geronimo.apache.org
> >
> > Kanchana Welagedara wrote:
> >> Hi all
> >>
> >> I followed the following steps to build code  on a new machine and I
> >> started with /bootstrap.
> >>
> >>
> >>
> >> http://cwiki.apache.org/GMOxDEV/building-apache-geronimo-with-
> >> maven-2.html
> >>
> >>
> >> At the bootstrap I got as"Build successful" at the end but in the
> >> middle I got an error
> >>
> >> [exec]     at org.codehaus.classworlds.Launcher.main(Launcher.java:
> >> 375)
> >>     [exec] [INFO]
> >> ---------------------------------------------------------------------
> >> ---
> >>     [exec] [ERROR] BUILD ERROR
> >>     [exec] [INFO]
> >> ---------------------------------------------------------------------
> >> ---
> >>     [exec] [INFO] Unknown start exception
> >>     [exec]
> >>
> >> May I consider bootstrap successfully done the build ?
> >>
> >> My OS is Debian/sarge upgraded and I got the following bootstrap.log
> >> and when I did a
> >>
> >> mvn -e clean install I got following errors
> >>
> >> + Error stacktraces are turned on.
> >> [INFO] Scanning for projects...
> >> [INFO] Reactor build order:
> >> [INFO]   Geronimo
> >> [INFO]   Geronimo Test Support
> >> [INFO]   Geronimo Test Support :: Common
> >> [INFO]   Geronimo Test Support, Test Deployment J2EE 1.3
> >> [INFO]   Geronimo Test Support, Test Deployment J2EE 1.3 :: EJB
> >> [INFO]   Geronimo Test Support, Test Deployment J2EE 1.3 :: WAR
> >> [INFO]   Geronimo Test Support, Test Deployment J2EE 1.3 :: RAR
> >> [INFO]   Geronimo Test Support, Test Deployment J2EE 1.3 :: EAR
> >> [INFO]   Geronimo Test Support, Test Deployment J2EE 1.4
> >> [INFO]   Geronimo Test Support, Test Deployment J2EE 1.4 :: EJB
> >> [INFO]   Geronimo Test Support, Test Deployment J2EE 1.4 :: WAR
> >> [INFO]   Geronimo Test Support, Test Deployment J2EE 1.4 :: RAR
> >> [INFO]   Geronimo Test Support, Test Deployment J2EE 1.4 :: EAR
> >> [INFO]   Geronimo :: Modules
> >> [INFO]   Geronimo :: Activation
> >> [INFO]   Geronimo :: ActiveMQ Embedded RAR
> >> [INFO]   Geronimo :: Kernel
> >> [INFO]   Geronimo :: Common
> >> [INFO]   Geronimo :: Util
> >> [INFO]   Geronimo :: System
> >> [INFO]   Geronimo :: Management API
> >> [INFO]   Geronimo :: ActiveMQ GBean Management Interfaces
> >> [INFO]   Geronimo :: J2EE
> >> [INFO]   Geronimo :: Interceptor
> >> [INFO]   Geronimo :: Core
> >> [INFO]   Geronimo :: Security
> >> [INFO]   Geronimo :: Transaction
> >> [INFO]   Geronimo :: Naming
> >> [INFO]   Geronimo :: Deployment
> >> [INFO]   Geronimo :: Connector
> >> [INFO]   Geronimo :: ActiveMQ GBeans
> >> [INFO]   Geronimo :: Web Services
> >> [INFO]   Geronimo :: Axis
> >> [INFO]   Geronimo :: Deploy :: Common Config
> >> [INFO]   Geronimo :: Service :: Builder
> >> [INFO]   Geronimo :: J2EE Schema
> >> [INFO]   Geronimo :: J2EE :: Builder
> >> [INFO]   Geronimo :: Naming :: Builder
> >> [INFO]   Geronimo :: Axis :: Builder
> >> [INFO]   Geronimo :: Client
> >> [INFO]   Geronimo :: Test :: DDBeans
> >> [INFO]   Geronimo :: Connector :: Builder
> >> [INFO]   Geronimo :: Security :: Builder
> >> [INFO]   Geronimo :: Client Builder
> >> [INFO]   Geronimo Clustering
> >> [INFO]   Geronimo Clustering WADI
> >> [INFO]   Geronimo Clustering Builder WADI
> >> [INFO]   Geronimo :: Configuration Converter
> >> [INFO]   Geronimo :: Web :: Builder
> >> [INFO]   Geronimo :: Deploy :: JSR-88
> >> [INFO]   Geronimo :: Deploy :: CLI Tool
> >> [INFO]   Geronimo :: Derby
> >> [INFO]   Geronimo :: Directory
> >> [INFO]   Geronimo :: Deploy :: Hot Deployer
> >> [INFO]   Geronimo :: Jetty
> >> [INFO]   Geronimo :: Jetty :: Builder
> >> [INFO]   Geronimo :: JMX Remoting
> >> [INFO]   Geronimo :: Mail
> >> [INFO]   Geronimo :: Timer
> >> [INFO]   Geronimo :: Tomcat
> >> [INFO]   Geronimo :: Tomcat :: Builder
> >> [INFO]   Geronimo :: Upgrade
> >> [INFO]   Geronimo Maven2 Plugins
> >> [INFO]   Geronimo Maven2 Plugins :: CAR
> >> [INFO]   Geronimo Maven2 Plugins :: Deployment
> >> [INFO]   Geronimo Maven2 Plugins :: Geronimo
> >> [INFO]   Geronimo Maven2 Plugins :: Selenium
> >> [INFO]   Geronimo Applications
> >> [INFO]   Geronimo Applications :: Welcome
> >> [INFO]   Geronimo Applications :: Dojo
> >> [INFO]   Geronimo Applications, Examples
> >> [INFO]   Geronimo Applications, Examples :: JSP (JSR 152)
> >> [INFO]   Geronimo Applications, Examples :: Servlet (JSR 154)
> >> [INFO]   Geronimo Applications :: Console
> >> [INFO]   Geronimo Applications, Console :: Core
> >> [INFO]   Geronimo Applications, Console :: Standard Portlets
> >> [INFO]   Geronimo Applications, Console :: Portal Framework
> >> [INFO]   Geronimo Applications, Console :: EAR
> >> [INFO]   Geronimo Applications :: Remote Deploy
> >> [INFO]   Geronimo Applications :: UDDI Server Database
> >> [INFO]   Geronimo Applications :: UDDI Server
> >> [INFO]   Geronimo Applications :: LDAP Demo
> >> [INFO]   Geronimo Applications :: The Magic G Ball
> >> [INFO]   Geronimo Applications, The Magic G Ball :: EJB
> >> [INFO]   Geronimo Applications, The Magic G Ball :: Client
> >> [INFO]   Geronimo Applications, The Magic G Ball :: WAR
> >> [INFO]   Geronimo Applications, The Magic G Ball :: EAR
> >> [INFO]   Geronimo Applications :: Demo
> >> [INFO]   Geronimo Configs
> >> [INFO]   Geronimo Configs :: GBean Deployer
> >> [INFO]   Geronimo Configs :: J2EE System
> >> [INFO]   Geronimo Configs :: RMI Naming
> >> [INFO]   Geronimo Configs :: J2EE Server
> >> [INFO]   Geronimo Configs :: Transaction Manager
> >> [INFO]   Geronimo Configs :: J2EE Security
> >> [INFO]   Geronimo Configs :: J2EE Deployer
> >> [INFO]   Geronimo Configs :: Connector Deployer
> >> [INFO]   Geronimo Configs :: System Database
> >> [INFO]   Geronimo Configs :: ActiveMQ Broker
> >> [INFO]   Geronimo Configs :: ActiveMQ
> >> [INFO]   Geronimo Configs :: Axis
> >> [INFO]   Geronimo Configs :: Axis Deployer
> >> [INFO]   Geronimo Configs :: Client System
> >> [INFO]   Geronimo Configs :: J2EE Client
> >> [INFO]   Geronimo Configs :: OpenEJB
> >> [INFO]   Geronimo Configs :: OpenEJB Deployer
> >> [INFO]   Geronimo Configs :: Corba J2EE Client
> >> [INFO]   Geronimo Configs :: J2EE Client transaction
> >> [INFO]   Geronimo Configs :: Application Client Deployments
> >> [INFO]   Geronimo Configs :: J2EE Client Security
> >> [INFO]   Geronimo Configs :: Jetty
> >> [INFO]   Geronimo Configs :: Jetty Deployer
> >> [INFO]   Geronimo Configs :: Dojo app jetty
> >> [INFO]   Geronimo Configs :: WebConsole Jetty
> >> [INFO]   Geronimo Configs :: Tomcat
> >> [INFO]   Geronimo Configs :: Tomcat Deployer
> >> [INFO]   Geronimo Configs :: Dojo app Tomcat
> >> [INFO]   Geronimo Configs :: WebConsole Tomcat
> >> [INFO]   Geronimo Configs :: Directory
> >> [INFO]   Geronimo Configs :: Hot Deployer
> >> [INFO]   Geronimo Configs :: J2EE Corba
> >> [INFO]   Geronimo Configs :: JavaMail
> >> [INFO]   Geronimo Configs :: Jetty Clustering Builder WADI
> >> [INFO]   Geronimo Configs :: Jetty Clustering WADI
> >> [INFO]   Geronimo Configs :: JSP Examples Jetty
> >> [INFO]   Geronimo Configs :: JSP Examples Tomcat
> >> [INFO]   Geronimo Configs :: LDAP Demo for Jetty
> >> [INFO]   Geronimo Configs :: LDAP Demo for Tomcat
> >> [INFO]   Geronimo Configs :: LDAP Security Realm
> >> [INFO]   Geronimo Configs :: Online Deployer
> >> [INFO]   Geronimo Configs :: Remote Deploy Jetty
> >> [INFO]   Geronimo Configs :: Remote Deploy Tomcat
> >> [INFO]   Geronimo Configs :: Servlet Examples for Jetty
> >> [INFO]   Geronimo Configs :: Servlet Examples for Tomcat
> >> [INFO]   Geronimo Configs :: Shared Library
> >> [INFO]   Geronimo Configs :: Shutdown
> >> [INFO]   Geronimo Configs :: UDDI Jetty
> >> [INFO]   Geronimo Configs :: UDDI Tomcat
> >> [INFO]   Geronimo Configs :: Unavailable Client Deployer
> >> [INFO]   Geronimo Configs :: Unavailable EJB Deployer
> >> [INFO]   Geronimo Configs :: Unavailable Web Services Deployer
> >> [INFO]   Geronimo Configs :: Plan Upgrade
> >> [INFO]   Geronimo Configs :: CLI Upgrade
> >> [INFO]   Geronimo Configs :: Welcome app Jetty
> >> [INFO]   Geronimo Configs :: Welcome app Tomcat
> >> [INFO]   Geronimo Assemblies
> >> [INFO]   Geronimo Assemblies :: Boilerplate Minimal
> >> [INFO]   Geronimo Assemblies :: Boilerplate J2EE
> >> [INFO]   Geronimo Assemblies :: J2EE + Jetty
> >> [INFO]   Geronimo Assemblies :: Minimal + Jetty
> >> [INFO]   Geronimo Assemblies :: J2EE + Tomcat
> >> [INFO]   Geronimo Assemblies :: Minimal + Tomcat
> >> [INFO]
> >> ---------------------------------------------------------------------
> >> -------
> >>
> >> [INFO] Building Geronimo
> >> [INFO]    task-segment: [clean, install]
> >> [INFO]
> >> ---------------------------------------------------------------------
> >> -------
> >>
> >> [INFO] [clean:clean]
> >> [INFO] Deleting directory /home/kanchana/Geronimo/svn/server/target
> >> [INFO] Deleting directory
> >> /home/kanchana/Geronimo/svn/server/target/classes
> >> [INFO] Deleting directory
> >> /home/kanchana/Geronimo/svn/server/target/test-classes
> >> [INFO] [tools:require-java-version {execution: validate-java-
> >> version}]
> >> [INFO] [tools:copy-legal-files {execution: install-legal-files}]
> >> [INFO] [site:attach-descriptor]
> >> [WARNING] Unable to load parent project from repository: Could not
> >> find the model file '/home/kanchana/Geronimo/svn/server/../pom.xml'.
> >> [INFO] [install:install]
> >> [INFO] Installing /home/kanchana/Geronimo/svn/server/pom.xml to
> >> /root/.m2/repository/org/apache/geronimo/geronimo/1.2-SNAPSHOT/
> >> geronimo-1.2-SNAPSHOT.pom
> >>
> >> [INFO]
> >> ---------------------------------------------------------------------
> >> -------
> >>
> >> [INFO] Building Geronimo Test Support
> >> [INFO]    task-segment: [clean, install]
> >> [INFO]
> >> ---------------------------------------------------------------------
> >> -------
> >>
> >> [INFO] [clean:clean]
> >> [INFO] Deleting directory
> >> /home/kanchana/Geronimo/svn/server/testsupport/target
> >> [INFO] Deleting directory
> >> /home/kanchana/Geronimo/svn/server/testsupport/target/classes
> >> [INFO] Deleting directory
> >> /home/kanchana/Geronimo/svn/server/testsupport/target/test-classes
> >> [INFO] [tools:require-java-version {execution: validate-java-
> >> version}]
> >> [INFO] [tools:copy-legal-files {execution: install-legal-files}]
> >> [INFO] [site:attach-descriptor]
> >> [INFO] [install:install]
> >> [INFO] Installing
> >> /home/kanchana/Geronimo/svn/server/testsupport/pom.xml to
> >> /root/.m2/repository/org/apache/geronimo/testsupport/testsupport/
> >> 1.2-SNAPSHOT/testsupport-1.2-SNAPSHOT.pom
> >>
> >> [INFO]
> >> ---------------------------------------------------------------------
> >> -------
> >>
> >> [INFO] Building Geronimo Test Support :: Common
> >> [INFO]    task-segment: [clean, install]
> >> [INFO]
> >> ---------------------------------------------------------------------
> >> -------
> >>
> >> [INFO] [clean:clean]
> >> [INFO] Deleting directory
> >> /home/kanchana/Geronimo/svn/server/testsupport/testsupport-common/
> >> target
> >> [INFO] Deleting directory
> >> /home/kanchana/Geronimo/svn/server/testsupport/testsupport-common/
> >> target/classes
> >>
> >> [INFO] Deleting directory
> >> /home/kanchana/Geronimo/svn/server/testsupport/testsupport-common/
> >> target/test-classes
> >>
> >> [INFO] [tools:require-java-version {execution: validate-java-
> >> version}]
> >> [INFO] [tools:copy-legal-files {execution: install-legal-files}]
> >> [INFO] Created dir:
> >> /home/kanchana/Geronimo/svn/server/testsupport/testsupport-common/
> >> target/classes/META-INF
> >>
> >> [INFO] Copying 2 files to
> >> /home/kanchana/Geronimo/svn/server/testsupport/testsupport-common/
> >> target/classes/META-INF
> >>
> >> [INFO] [resources:resources]
> >> [INFO] Using default encoding to copy filtered resources.
> >> [INFO] [compiler:compile]
> >> Compiling 2 source files to
> >> /home/kanchana/Geronimo/svn/server/testsupport/testsupport-common/
> >> target/classes
> >>
> >> [INFO] [resources:testResources]
> >> [INFO] Using default encoding to copy filtered resources.
> >> [INFO] [compiler:testCompile]
> >> [INFO] No sources to compile
> >> [INFO] [surefire:test]
> >> [INFO] No tests to run.
> >> [INFO] [jar:jar]
> >> [INFO] Building jar:
> >> /home/kanchana/Geronimo/svn/server/testsupport/testsupport-common/
> >> target/testsupport-common-1.2-SNAPSHOT.jar
> >>
> >> [INFO] [install:install]
> >> [INFO] Installing
> >> /home/kanchana/Geronimo/svn/server/testsupport/testsupport-common/
> >> target/testsupport-common-1.2-SNAPSHOT.jar
> >>
> >> to
> >> /root/.m2/repository/org/apache/geronimo/testsupport/testsupport-
> >> common/1.2-SNAPSHOT/testsupport-common-1.2-SNAPSHOT.jar
> >>
> >> [INFO]
> >> ---------------------------------------------------------------------
> >> -------
> >>
> >> [INFO] Building Geronimo Test Support, Test Deployment J2EE 1.3
> >> [INFO]    task-segment: [clean, install]
> >> [INFO]
> >> ---------------------------------------------------------------------
> >> -------
> >>
> >> [INFO] [clean:clean]
> >> [INFO] Deleting directory
> >> /home/kanchana/Geronimo/svn/server/testsupport/test-deployment-
> >> j2ee_1.3/target
> >>
> >> [INFO] Deleting directory
> >> /home/kanchana/Geronimo/svn/server/testsupport/test-deployment-
> >> j2ee_1.3/target/classes
> >>
> >> [INFO] Deleting directory
> >> /home/kanchana/Geronimo/svn/server/testsupport/test-deployment-
> >> j2ee_1.3/target/test-classes
> >>
> >> [INFO] [tools:require-java-version {execution: validate-java-
> >> version}]
> >> [INFO] [tools:copy-legal-files {execution: install-legal-files}]
> >> [INFO] [site:attach-descriptor]
> >> [INFO] [install:install]
> >> [INFO] Installing
> >> /home/kanchana/Geronimo/svn/server/testsupport/test-deployment-
> >> j2ee_1.3/pom.xml
> >>
> >> to
> >> /root/.m2/repository/org/apache/geronimo/testsupport/test-
> >> deployment-j2ee_1.3/1.2-SNAPSHOT/test-deployment-j2ee_1.3-1.2-
> >> SNAPSHOT.pom
> >>
> >> [INFO]
> >> ---------------------------------------------------------------------
> >> -------
> >>
> >> [INFO] Building Geronimo Test Support, Test Deployment J2EE 1.3 ::
> >> EJB
> >> [INFO]    task-segment: [clean, install]
> >> [INFO]
> >> ---------------------------------------------------------------------
> >> -------
> >>
> >> [INFO] [clean:clean]
> >> [INFO] Deleting directory
> >> /home/kanchana/Geronimo/svn/server/testsupport/test-deployment-
> >> j2ee_1.3/test-ejb-j2ee_1.3/target
> >>
> >> [INFO] Deleting directory
> >> /home/kanchana/Geronimo/svn/server/testsupport/test-deployment-
> >> j2ee_1.3/test-ejb-j2ee_1.3/target/classes
> >>
> >> [INFO] Deleting directory
> >> /home/kanchana/Geronimo/svn/server/testsupport/test-deployment-
> >> j2ee_1.3/test-ejb-j2ee_1.3/target/test-classes
> >>
> >> [INFO] [tools:require-java-version {execution: validate-java-
> >> version}]
> >> [INFO] [tools:copy-legal-files {execution: install-legal-files}]
> >> [INFO] Created dir:
> >> /home/kanchana/Geronimo/svn/server/testsupport/test-deployment-
> >> j2ee_1.3/test-ejb-j2ee_1.3/target/classes/META-INF
> >>
> >> [INFO] Copying 2 files to
> >> /home/kanchana/Geronimo/svn/server/testsupport/test-deployment-
> >> j2ee_1.3/test-ejb-j2ee_1.3/target/classes/META-INF
> >>
> >> [INFO] [resources:resources]
> >> [INFO] Using default encoding to copy filtered resources.
> >> [INFO] [compiler:compile]
> >> Compiling 20 source files to
> >> /home/kanchana/Geronimo/svn/server/testsupport/test-deployment-
> >> j2ee_1.3/test-ejb-j2ee_1.3/target/classes
> >>
> >> [INFO] [resources:testResources]
> >> [INFO] Using default encoding to copy filtered resources.
> >> [INFO] [compiler:testCompile]
> >> [INFO] No sources to compile
> >> [INFO] [surefire:test]
> >> [INFO] No tests to run.
> >> [INFO] [ejb:ejb]
> >> [INFO] Building ejb test-ejb-j2ee_1.3-1.2-SNAPSHOT
> >> [INFO] Building jar:
> >> /home/kanchana/Geronimo/svn/server/testsupport/test-deployment-
> >> j2ee_1.3/test-ejb-j2ee_1.3/target/test-ejb-j2ee_1.3-1.2-SNAPSHOT.jar
> >>
> >> [INFO] [install:install]
> >> [INFO] Installing
> >> /home/kanchana/Geronimo/svn/server/testsupport/test-deployment-
> >> j2ee_1.3/test-ejb-j2ee_1.3/target/test-ejb-j2ee_1.3-1.2-SNAPSHOT.jar
> >>
> >> to
> >> /root/.m2/repository/org/apache/geronimo/testsupport/test-ejb-
> >> j2ee_1.3/1.2-SNAPSHOT/test-ejb-j2ee_1.3-1.2-SNAPSHOT.jar
> >>
> >> [INFO]
> >> ---------------------------------------------------------------------
> >> -------
> >>
> >> [INFO] Building Geronimo Test Support, Test Deployment J2EE 1.3 ::
> >> WAR
> >> [INFO]    task-segment: [clean, install]
> >> [INFO]
> >> ---------------------------------------------------------------------
> >> -------
> >>
> >> [INFO] [clean:clean]
> >> [INFO] Deleting directory
> >> /home/kanchana/Geronimo/svn/server/testsupport/test-deployment-
> >> j2ee_1.3/test-war-j2ee_1.3/target
> >>
> >> [INFO] Deleting directory
> >> /home/kanchana/Geronimo/svn/server/testsupport/test-deployment-
> >> j2ee_1.3/test-war-j2ee_1.3/target/classes
> >>
> >> [INFO] Deleting directory
> >> /home/kanchana/Geronimo/svn/server/testsupport/test-deployment-
> >> j2ee_1.3/test-war-j2ee_1.3/target/test-classes
> >>
> >> [INFO] [tools:require-java-version {execution: validate-java-
> >> version}]
> >> [INFO] [tools:copy-legal-files {execution: install-legal-files}]
> >> [INFO] Created dir:
> >> /home/kanchana/Geronimo/svn/server/testsupport/test-deployment-
> >> j2ee_1.3/test-war-j2ee_1.3/target/classes/META-INF
> >>
> >> [INFO] Copying 2 files to
> >> /home/kanchana/Geronimo/svn/server/testsupport/test-deployment-
> >> j2ee_1.3/test-war-j2ee_1.3/target/classes/META-INF
> >>
> >> [INFO] [resources:resources]
> >> [INFO] Using default encoding to copy filtered resources.
> >> [INFO] [compiler:compile]
> >> [INFO] No sources to compile
> >> [INFO] [resources:testResources]
> >> [INFO] Using default encoding to copy filtered resources.
> >> [INFO] [compiler:testCompile]
> >> [INFO] No sources to compile
> >> [INFO] [surefire:test]
> >> [INFO] No tests to run.
> >> [WARNING]
> >>     Artifact org.codehaus.plexus:plexus-utils:jar:1.0.4:runtime
> >> retains
> >> local scope 'runtime' overriding broader scope 'compile'
> >>     given by a dependency. If this is not intended, modify or
> >> remove the
> >> local scope.
> >>
> >> [WARNING]
> >>     Artifact org.apache.maven:maven-artifact:jar:2.0.1:runtime
> >> retains
> >> local scope 'runtime' overriding broader scope 'compile'
> >>     given by a dependency. If this is not intended, modify or
> >> remove the
> >> local scope.
> >>
> >> [INFO] [war:war]
> >> [INFO] Exploding webapp...
> >> [INFO] Copy webapp webResources to
> >> /home/kanchana/Geronimo/svn/server/testsupport/test-deployment-
> >> j2ee_1.3/test-war-j2ee_1.3/target/test-war-j2ee_1.3-1.2-SNAPSHOT
> >>
> >> [INFO] Assembling webapp test-war-j2ee_1.3 in
> >> /home/kanchana/Geronimo/svn/server/testsupport/test-deployment-
> >> j2ee_1.3/test-war-j2ee_1.3/target/test-war-j2ee_1.3-1.2-SNAPSHOT
> >>
> >> [INFO] Building jar:
> >> /home/kanchana/Geronimo/svn/server/testsupport/test-deployment-
> >> j2ee_1.3/test-war-j2ee_1.3/target/test-war-j2ee_1.3-1.2-SNAPSHOT/
> >> WEB-INF/lib/test-war-j2ee_1.3-1.2-SNAPSHOT.jar
> >>
> >> [INFO] Generating war
> >> /home/kanchana/Geronimo/svn/server/testsupport/test-deployment-
> >> j2ee_1.3/test-war-j2ee_1.3/target/test-war-j2ee_1.3-1.2-SNAPSHOT.war
> >>
> >> [INFO] Building war:
> >> /home/kanchana/Geronimo/svn/server/testsupport/test-deployment-
> >> j2ee_1.3/test-war-j2ee_1.3/target/test-war-j2ee_1.3-1.2-SNAPSHOT.war
> >>
> >> [INFO] [install:install]
> >> [INFO] Installing
> >> /home/kanchana/Geronimo/svn/server/testsupport/test-deployment-
> >> j2ee_1.3/test-war-j2ee_1.3/target/test-war-j2ee_1.3-1.2-SNAPSHOT.war
> >>
> >> to
> >> /root/.m2/repository/org/apache/geronimo/testsupport/test-war-
> >> j2ee_1.3/1.2-SNAPSHOT/test-war-j2ee_1.3-1.2-SNAPSHOT.war
> >>
> >> [INFO]
> >> ---------------------------------------------------------------------
> >> -------
> >>
> >> [INFO] Building Geronimo Test Support, Test Deployment J2EE 1.3 ::
> >> RAR
> >> [INFO]    task-segment: [clean, install]
> >> [INFO]
> >> ---------------------------------------------------------------------
> >> -------
> >>
> >> [INFO] [clean:clean]
> >> [INFO] Deleting directory
> >> /home/kanchana/Geronimo/svn/server/testsupport/test-deployment-
> >> j2ee_1.3/test-rar-j2ee_1.3/target
> >>
> >> [INFO] Deleting directory
> >> /home/kanchana/Geronimo/svn/server/testsupport/test-deployment-
> >> j2ee_1.3/test-rar-j2ee_1.3/target/classes
> >>
> >> [INFO] Deleting directory
> >> /home/kanchana/Geronimo/svn/server/testsupport/test-deployment-
> >> j2ee_1.3/test-rar-j2ee_1.3/target/test-classes
> >>
> >> [INFO] [tools:require-java-version {execution: validate-java-
> >> version}]
> >> [INFO] [tools:copy-legal-files {execution: install-legal-files}]
> >> [INFO] Created dir:
> >> /home/kanchana/Geronimo/svn/server/testsupport/test-deployment-
> >> j2ee_1.3/test-rar-j2ee_1.3/target/classes/META-INF
> >>
> >> [INFO] Copying 2 files to
> >> /home/kanchana/Geronimo/svn/server/testsupport/test-deployment-
> >> j2ee_1.3/test-rar-j2ee_1.3/target/classes/META-INF
> >>
> >> [INFO] [resources:resources]
> >> [INFO] Using default encoding to copy filtered resources.
> >> [INFO] [compiler:compile]
> >> [INFO] No sources to compile
> >> [INFO] [resources:testResources]
> >> [INFO] Using default encoding to copy filtered resources.
> >> [INFO] [compiler:testCompile]
> >> [INFO] No sources to compile
> >> [INFO] [surefire:test]
> >> [INFO] No tests to run.
> >> [INFO] [rar:rar]
> >> [INFO] Copy rar resources to
> >> /home/kanchana/Geronimo/svn/server/testsupport/test-deployment-
> >> j2ee_1.3/test-rar-j2ee_1.3/target/test-rar-j2ee_1.3-1.2-SNAPSHOT
> >>
> >> [INFO] Using ra.xml
> >> /home/kanchana/Geronimo/svn/server/testsupport/test-deployment-
> >> j2ee_1.3/test-rar-j2ee_1.3/src/main/rar/META-INF/ra.xml
> >>
> >> [INFO] Could not find manifest file:
> >> /home/kanchana/Geronimo/svn/server/testsupport/test-deployment-
> >> j2ee_1.3/test-rar-j2ee_1.3/src/main/rar/META-INF/MANIFEST.MF
> >>
> >> - Generating one
> >> [INFO] Building jar:
> >> /home/kanchana/Geronimo/svn/server/testsupport/test-deployment-
> >> j2ee_1.3/test-rar-j2ee_1.3/target/test-rar-j2ee_1.3-1.2-SNAPSHOT.rar
> >>
> >> [INFO] [install:install]
> >> [INFO] Installing
> >> /home/kanchana/Geronimo/svn/server/testsupport/test-deployment-
> >> j2ee_1.3/test-rar-j2ee_1.3/target/test-rar-j2ee_1.3-1.2-SNAPSHOT.rar
> >>
> >> to
> >> /root/.m2/repository/org/apache/geronimo/testsupport/test-rar-
> >> j2ee_1.3/1.2-SNAPSHOT/test-rar-j2ee_1.3-1.2-SNAPSHOT.rar
> >>
> >> [INFO]
> >> ---------------------------------------------------------------------
> >> -------
> >>
> >> [INFO] Building Geronimo Test Support, Test Deployment J2EE 1.3 ::
> >> EAR
> >> [INFO]    task-segment: [clean, install]
> >> [INFO]
> >> ---------------------------------------------------------------------
> >> -------
> >>
> >> [INFO] [clean:clean]
> >> [INFO] Deleting directory
> >> /home/kanchana/Geronimo/svn/server/testsupport/test-deployment-
> >> j2ee_1.3/test-ear-j2ee_1.3/target
> >>
> >> [INFO] Deleting directory
> >> /home/kanchana/Geronimo/svn/server/testsupport/test-deployment-
> >> j2ee_1.3/test-ear-j2ee_1.3/target/classes
> >>
> >> [INFO] Deleting directory
> >> /home/kanchana/Geronimo/svn/server/testsupport/test-deployment-
> >> j2ee_1.3/test-ear-j2ee_1.3/target/test-classes
> >>
> >> [INFO] [tools:require-java-version {execution: validate-java-
> >> version}]
> >> [INFO] [ear:generate-application-xml]
> >> [INFO] Generating application.xml
> >> [INFO] [tools:copy-legal-files {execution: install-legal-files}]
> >> [INFO] Created dir:
> >> /home/kanchana/Geronimo/svn/server/testsupport/test-deployment-
> >> j2ee_1.3/test-ear-j2ee_1.3/target/classes/META-INF
> >>
> >> [INFO] Copying 2 files to
> >> /home/kanchana/Geronimo/svn/server/testsupport/test-deployment-
> >> j2ee_1.3/test-ear-j2ee_1.3/target/classes/META-INF
> >>
> >> [INFO] [resources:resources]
> >> [INFO] Using default encoding to copy filtered resources.
> >> [INFO] [ear:ear]
> >> [INFO] Copying
> >> artifact[war:org.apache.geronimo.testsupport:test-war-j2ee_1.3:1.2-
> >> SNAPSHOT]
> >>
> >> to[web.war]
> >> [INFO] Copying
> >> artifact[ejb:org.apache.geronimo.testsupport:test-ejb-j2ee_1.3:1.2-
> >> SNAPSHOT]
> >>
> >> to[ejb.jar]
> >> [INFO] Copying
> >> artifact[rar:org.apache.geronimo.testsupport:test-rar-j2ee_1.3:1.2-
> >> SNAPSHOT]
> >>
> >> to[rar.rar]
> >> [INFO] Copy ear resources to
> >> /home/kanchana/Geronimo/svn/server/testsupport/test-deployment-
> >> j2ee_1.3/test-ear-j2ee_1.3/target/test-ear-j2ee_1.3-1.2-SNAPSHOT
> >>
> >> [INFO] Could not find manifest file:
> >> /home/kanchana/Geronimo/svn/server/testsupport/test-deployment-
> >> j2ee_1.3/test-ear-j2ee_1.3/src/main/application/META-INF/MANIFEST.MF
> >>
> >> - Generating one
> >> [INFO] Building jar:
> >> /home/kanchana/Geronimo/svn/server/testsupport/test-deployment-
> >> j2ee_1.3/test-ear-j2ee_1.3/target/test-ear-j2ee_1.3-1.2-SNAPSHOT.ear
> >>
> >> [INFO] [install:install]
> >> [INFO] Installing
> >> /home/kanchana/Geronimo/svn/server/testsupport/test-deployment-
> >> j2ee_1.3/test-ear-j2ee_1.3/target/test-ear-j2ee_1.3-1.2-SNAPSHOT.ear
> >>
> >> to
> >> /root/.m2/repository/org/apache/geronimo/testsupport/test-ear-
> >> j2ee_1.3/1.2-SNAPSHOT/test-ear-j2ee_1.3-1.2-SNAPSHOT.ear
> >>
> >> [INFO]
> >> ---------------------------------------------------------------------
> >> -------
> >>
> >> [INFO] Building Geronimo Test Support, Test Deployment J2EE 1.4
> >> [INFO]    task-segment: [clean, install]
> >> [INFO]
> >> ---------------------------------------------------------------------
> >> -------
> >>
> >> [INFO] [clean:clean]
> >> [INFO] Deleting directory
> >> /home/kanchana/Geronimo/svn/server/testsupport/test-deployment-
> >> j2ee_1.4/target
> >>
> >> [INFO] Deleting directory
> >> /home/kanchana/Geronimo/svn/server/testsupport/test-deployment-
> >> j2ee_1.4/target/classes
> >>
> >> [INFO] Deleting directory
> >> /home/kanchana/Geronimo/svn/server/testsupport/test-deployment-
> >> j2ee_1.4/target/test-classes
> >>
> >> [INFO] [tools:require-java-version {execution: validate-java-
> >> version}]
> >> [INFO] [tools:copy-legal-files {execution: install-legal-files}]
> >> [INFO] [site:attach-descriptor]
> >> [INFO] [install:install]
> >> [INFO] Installing
> >> /home/kanchana/Geronimo/svn/server/testsupport/test-deployment-
> >> j2ee_1.4/pom.xml
> >>
> >> to
> >> /root/.m2/repository/org/apache/geronimo/testsupport/test-
> >> deployment-j2ee_1.4/1.2-SNAPSHOT/test-deployment-j2ee_1.4-1.2-
> >> SNAPSHOT.pom
> >>
> >> [INFO]
> >> ---------------------------------------------------------------------
> >> -------
> >>
> >> [INFO] Building Geronimo Test Support, Test Deployment J2EE 1.4 ::
> >> EJB
> >> [INFO]    task-segment: [clean, install]
> >> [INFO]
> >> ---------------------------------------------------------------------
> >> -------
> >>
> >> [INFO] [clean:clean]
> >> [INFO] Deleting directory
> >> /home/kanchana/Geronimo/svn/server/testsupport/test-deployment-
> >> j2ee_1.4/test-ejb-j2ee_1.4/target
> >>
> >> [INFO] Deleting directory
> >> /home/kanchana/Geronimo/svn/server/testsupport/test-deployment-
> >> j2ee_1.4/test-ejb-j2ee_1.4/target/classes
> >>
> >> [INFO] Deleting directory
> >> /home/kanchana/Geronimo/svn/server/testsupport/test-deployment-
> >> j2ee_1.4/test-ejb-j2ee_1.4/target/test-classes
> >>
> >> [INFO] [tools:require-java-version {execution: validate-java-
> >> version}]
> >> [INFO] [tools:copy-legal-files {execution: install-legal-files}]
> >> [INFO] Created dir:
> >> /home/kanchana/Geronimo/svn/server/testsupport/test-deployment-
> >> j2ee_1.4/test-ejb-j2ee_1.4/target/classes/META-INF
> >>
> >> [INFO] Copying 2 files to
> >> /home/kanchana/Geronimo/svn/server/testsupport/test-deployment-
> >> j2ee_1.4/test-ejb-j2ee_1.4/target/classes/META-INF
> >>
> >> [INFO] [resources:resources]
> >> [INFO] Using default encoding to copy filtered resources.
> >> [INFO] [compiler:compile]
> >> Compiling 20 source files to
> >> /home/kanchana/Geronimo/svn/server/testsupport/test-deployment-
> >> j2ee_1.4/test-ejb-j2ee_1.4/target/classes
> >>
> >> [INFO] [resources:testResources]
> >> [INFO] Using default encoding to copy filtered resources.
> >> [INFO] [compiler:testCompile]
> >> [INFO] No sources to compile
> >> [INFO] [surefire:test]
> >> [INFO] No tests to run.
> >> [INFO] [ejb:ejb]
> >> [INFO] Building ejb test-ejb-j2ee_1.4-1.2-SNAPSHOT
> >> [INFO] Building jar:
> >> /home/kanchana/Geronimo/svn/server/testsupport/test-deployment-
> >> j2ee_1.4/test-ejb-j2ee_1.4/target/test-ejb-j2ee_1.4-1.2-SNAPSHOT.jar
> >>
> >> [INFO] [install:install]
> >> [INFO] Installing
> >> /home/kanchana/Geronimo/svn/server/testsupport/test-deployment-
> >> j2ee_1.4/test-ejb-j2ee_1.4/target/test-ejb-j2ee_1.4-1.2-SNAPSHOT.jar
> >>
> >> to
> >> /root/.m2/repository/org/apache/geronimo/testsupport/test-ejb-
> >> j2ee_1.4/1.2-SNAPSHOT/test-ejb-j2ee_1.4-1.2-SNAPSHOT.jar
> >>
> >> [INFO]
> >> ---------------------------------------------------------------------
> >> -------
> >>
> >> [INFO] Building Geronimo Test Support, Test Deployment J2EE 1.4 ::
> >> WAR
> >> [INFO]    task-segment: [clean, install]
> >> [INFO]
> >> ---------------------------------------------------------------------
> >> -------
> >>
> >> [INFO] [clean:clean]
> >> [INFO] Deleting directory
> >> /home/kanchana/Geronimo/svn/server/testsupport/test-deployment-
> >> j2ee_1.4/test-war-j2ee_1.4/target
> >>
> >> [INFO] Deleting directory
> >> /home/kanchana/Geronimo/svn/server/testsupport/test-deployment-
> >> j2ee_1.4/test-war-j2ee_1.4/target/classes
> >>
> >> [INFO] Deleting directory
> >> /home/kanchana/Geronimo/svn/server/testsupport/test-deployment-
> >> j2ee_1.4/test-war-j2ee_1.4/target/test-classes
> >>
> >> [INFO] [tools:require-java-version {execution: validate-java-
> >> version}]
> >> [INFO] [tools:copy-legal-files {execution: install-legal-files}]
> >> [INFO] Created dir:
> >> /home/kanchana/Geronimo/svn/server/testsupport/test-deployment-
> >> j2ee_1.4/test-war-j2ee_1.4/target/classes/META-INF
> >>
> >> [INFO] Copying 2 files to
> >> /home/kanchana/Geronimo/svn/server/testsupport/test-deployment-
> >> j2ee_1.4/test-war-j2ee_1.4/target/classes/META-INF
> >>
> >> [INFO] [resources:resources]
> >> [INFO] Using default encoding to copy filtered resources.
> >> [INFO] [compiler:compile]
> >> [INFO] No sources to compile
> >> [INFO] [resources:testResources]
> >> [INFO] Using default encoding to copy filtered resources.
> >> [INFO] [compiler:testCompile]
> >> [INFO] No sources to compile
> >> [INFO] [surefire:test]
> >> [INFO] No tests to run.
> >> [INFO] [war:war]
> >> [INFO] Exploding webapp...
> >> [INFO] Copy webapp webResources to
> >> /home/kanchana/Geronimo/svn/server/testsupport/test-deployment-
> >> j2ee_1.4/test-war-j2ee_1.4/target/test-war-j2ee_1.4-1.2-SNAPSHOT
> >>
> >> [INFO] Assembling webapp test-war-j2ee_1.4 in
> >> /home/kanchana/Geronimo/svn/server/testsupport/test-deployment-
> >> j2ee_1.4/test-war-j2ee_1.4/target/test-war-j2ee_1.4-1.2-SNAPSHOT
> >>
> >> [INFO] Building jar:
> >> /home/kanchana/Geronimo/svn/server/testsupport/test-deployment-
> >> j2ee_1.4/test-war-j2ee_1.4/target/test-war-j2ee_1.4-1.2-SNAPSHOT/
> >> WEB-INF/lib/test-war-j2ee_1.4-1.2-SNAPSHOT.jar
> >>
> >> [INFO] Generating war
> >> /home/kanchana/Geronimo/svn/server/testsupport/test-deployment-
> >> j2ee_1.4/test-war-j2ee_1.4/target/test-war-j2ee_1.4-1.2-SNAPSHOT.war
> >>
> >> [INFO] Building war:
> >> /home/kanchana/Geronimo/svn/server/testsupport/test-deployment-
> >> j2ee_1.4/test-war-j2ee_1.4/target/test-war-j2ee_1.4-1.2-SNAPSHOT.war
> >>
> >> [INFO] [install:install]
> >> [INFO] Installing
> >> /home/kanchana/Geronimo/svn/server/testsupport/test-deployment-
> >> j2ee_1.4/test-war-j2ee_1.4/target/test-war-j2ee_1.4-1.2-SNAPSHOT.war
> >>
> >> to
> >> /root/.m2/repository/org/apache/geronimo/testsupport/test-war-
> >> j2ee_1.4/1.2-SNAPSHOT/test-war-j2ee_1.4-1.2-SNAPSHOT.war
> >>
> >> [INFO]
> >> ---------------------------------------------------------------------
> >> -------
> >>
> >> [INFO] Building Geronimo Test Support, Test Deployment J2EE 1.4 ::
> >> RAR
> >> [INFO]    task-segment: [clean, install]
> >> [INFO]
> >> ---------------------------------------------------------------------
> >> -------
> >>
> >> [INFO] [clean:clean]
> >> [INFO] Deleting directory
> >> /home/kanchana/Geronimo/svn/server/testsupport/test-deployment-
> >> j2ee_1.4/test-rar-j2ee_1.4/target
> >>
> >> [INFO] Deleting directory
> >> /home/kanchana/Geronimo/svn/server/testsupport/test-deployment-
> >> j2ee_1.4/test-rar-j2ee_1.4/target/classes
> >>
> >> [INFO] Deleting directory
> >> /home/kanchana/Geronimo/svn/server/testsupport/test-deployment-
> >> j2ee_1.4/test-rar-j2ee_1.4/target/test-classes
> >>
> >> [INFO] [tools:require-java-version {execution: validate-java-
> >> version}]
> >> [INFO] [tools:copy-legal-files {execution: install-legal-files}]
> >> [INFO] Created dir:
> >> /home/kanchana/Geronimo/svn/server/testsupport/test-deployment-
> >> j2ee_1.4/test-rar-j2ee_1.4/target/classes/META-INF
> >>
> >> [INFO] Copying 2 files to
> >> /home/kanchana/Geronimo/svn/server/testsupport/test-deployment-
> >> j2ee_1.4/test-rar-j2ee_1.4/target/classes/META-INF
> >>
> >> [INFO] [resources:resources]
> >> [INFO] Using default encoding to copy filtered resources.
> >> [INFO] [compiler:compile]
> >> [INFO] No sources to compile
> >> [INFO] [resources:testResources]
> >> [INFO] Using default encoding to copy filtered resources.
> >> [INFO] [compiler:testCompile]
> >> [INFO] No sources to compile
> >> [INFO] [surefire:test]
> >> [INFO] No tests to run.
> >> [INFO] [rar:rar]
> >> [INFO] Copy rar resources to
> >> /home/kanchana/Geronimo/svn/server/testsupport/test-deployment-
> >> j2ee_1.4/test-rar-j2ee_1.4/target/test-rar-j2ee_1.4-1.2-SNAPSHOT
> >>
> >> [INFO] Using ra.xml
> >> /home/kanchana/Geronimo/svn/server/testsupport/test-deployment-
> >> j2ee_1.4/test-rar-j2ee_1.4/src/main/rar/META-INF/ra.xml
> >>
> >> [INFO] Could not find manifest file:
> >> /home/kanchana/Geronimo/svn/server/testsupport/test-deployment-
> >> j2ee_1.4/test-rar-j2ee_1.4/src/main/rar/META-INF/MANIFEST.MF
> >>
> >> - Generating one
> >> [INFO] Building jar:
> >> /home/kanchana/Geronimo/svn/server/testsupport/test-deployment-
> >> j2ee_1.4/test-rar-j2ee_1.4/target/test-rar-j2ee_1.4-1.2-SNAPSHOT.rar
> >>
> >> [INFO] [install:install]
> >> [INFO] Installing
> >> /home/kanchana/Geronimo/svn/server/testsupport/test-deployment-
> >> j2ee_1.4/test-rar-j2ee_1.4/target/test-rar-j2ee_1.4-1.2-SNAPSHOT.rar
> >>
> >> to
> >> /root/.m2/repository/org/apache/geronimo/testsupport/test-rar-
> >> j2ee_1.4/1.2-SNAPSHOT/test-rar-j2ee_1.4-1.2-SNAPSHOT.rar
> >>
> >> [INFO]
> >> ---------------------------------------------------------------------
> >> -------
> >>
> >> [INFO] Building Geronimo Test Support, Test Deployment J2EE 1.4 ::
> >> EAR
> >> [INFO]    task-segment: [clean, install]
> >> [INFO]
> >> ---------------------------------------------------------------------
> >> -------
> >>
> >> [INFO] [clean:clean]
> >> [INFO] Deleting directory
> >> /home/kanchana/Geronimo/svn/server/testsupport/test-deployment-
> >> j2ee_1.4/test-ear-j2ee_1.4/target
> >>
> >> [INFO] Deleting directory
> >> /home/kanchana/Geronimo/svn/server/testsupport/test-deployment-
> >> j2ee_1.4/test-ear-j2ee_1.4/target/classes
> >>
> >> [INFO] Deleting directory
> >> /home/kanchana/Geronimo/svn/server/testsupport/test-deployment-
> >> j2ee_1.4/test-ear-j2ee_1.4/target/test-classes
> >>
> >> [INFO] [tools:require-java-version {execution: validate-java-
> >> version}]
> >> [INFO] [ear:generate-application-xml]
> >> [INFO] Generating application.xml
> >> [INFO] [tools:copy-legal-files {execution: install-legal-files}]
> >> [INFO] Created dir:
> >> /home/kanchana/Geronimo/svn/server/testsupport/test-deployment-
> >> j2ee_1.4/test-ear-j2ee_1.4/target/classes/META-INF
> >>
> >> [INFO] Copying 2 files to
> >> /home/kanchana/Geronimo/svn/server/testsupport/test-deployment-
> >> j2ee_1.4/test-ear-j2ee_1.4/target/classes/META-INF
> >>
> >> [INFO] [resources:resources]
> >> [INFO] Using default encoding to copy filtered resources.
> >> [INFO] [ear:ear]
> >> [INFO] Copying
> >> artifact[war:org.apache.geronimo.testsupport:test-war-j2ee_1.4:1.2-
> >> SNAPSHOT]
> >>
> >> to[web.war]
> >> [INFO] Copying
> >> artifact[ejb:org.apache.geronimo.testsupport:test-ejb-j2ee_1.4:1.2-
> >> SNAPSHOT]
> >>
> >> to[ejb.jar]
> >> [INFO] Copying
> >> artifact[rar:org.apache.geronimo.testsupport:test-rar-j2ee_1.4:1.2-
> >> SNAPSHOT]
> >>
> >> to[rar.rar]
> >> [INFO] Copy ear resources to
> >> /home/kanchana/Geronimo/svn/server/testsupport/test-deployment-
> >> j2ee_1.4/test-ear-j2ee_1.4/target/test-ear-j2ee_1.4-1.2-SNAPSHOT
> >>
> >> [INFO] Could not find manifest file:
> >> /home/kanchana/Geronimo/svn/server/testsupport/test-deployment-
> >> j2ee_1.4/test-ear-j2ee_1.4/src/main/application/META-INF/MANIFEST.MF
> >>
> >> - Generating one
> >> [INFO] Building jar:
> >> /home/kanchana/Geronimo/svn/server/testsupport/test-deployment-
> >> j2ee_1.4/test-ear-j2ee_1.4/target/test-ear-j2ee_1.4-1.2-SNAPSHOT.ear
> >>
> >> [INFO] [install:install]
> >> [INFO] Installing
> >> /home/kanchana/Geronimo/svn/server/testsupport/test-deployment-
> >> j2ee_1.4/test-ear-j2ee_1.4/target/test-ear-j2ee_1.4-1.2-SNAPSHOT.ear
> >>
> >> to
> >> /root/.m2/repository/org/apache/geronimo/testsupport/test-ear-
> >> j2ee_1.4/1.2-SNAPSHOT/test-ear-j2ee_1.4-1.2-SNAPSHOT.ear
> >>
> >> [INFO]
> >> ---------------------------------------------------------------------
> >> -------
> >>
> >> [INFO] Building Geronimo :: Modules
> >> [INFO]    task-segment: [clean, install]
> >> [INFO]
> >> ---------------------------------------------------------------------
> >> -------
> >>
> >> [INFO] [clean:clean]
> >> [INFO] Deleting directory
> >> /home/kanchana/Geronimo/svn/server/modules/target
> >> [INFO] Deleting directory
> >> /home/kanchana/Geronimo/svn/server/modules/target/classes
> >> [INFO] Deleting directory
> >> /home/kanchana/Geronimo/svn/server/modules/target/test-classes
> >> [INFO] [tools:require-java-version {execution: validate-java-
> >> version}]
> >> [INFO] [tools:copy-legal-files {execution: install-legal-files}]
> >> [INFO] [site:attach-descriptor]
> >> [INFO] [install:install]
> >> [INFO] Installing /home/kanchana/Geronimo/svn/server/modules/pom.xml
> >> to
> >> /root/.m2/repository/org/apache/geronimo/modules/modules/1.2-
> >> SNAPSHOT/modules-1.2-SNAPSHOT.pom
> >>
> >> [INFO]
> >> ---------------------------------------------------------------------
> >> -------
> >>
> >> [INFO] Building Geronimo :: Activation
> >> [INFO]    task-segment: [clean, install]
> >> [INFO]
> >> ---------------------------------------------------------------------
> >> -------
> >>
> >> [INFO] [clean:clean]
> >> [INFO] Deleting directory
> >> /home/kanchana/Geronimo/svn/server/modules/geronimo-activation/target
> >> [INFO] Deleting directory
> >> /home/kanchana/Geronimo/svn/server/modules/geronimo-activation/
> >> target/classes
> >>
> >> [INFO] Deleting directory
> >> /home/kanchana/Geronimo/svn/server/modules/geronimo-activation/
> >> target/test-classes
> >>
> >> [INFO] [tools:require-java-version {execution: validate-java-
> >> version}]
> >> [INFO] [tools:copy-legal-files {execution: install-legal-files}]
> >> [INFO] Created dir:
> >> /home/kanchana/Geronimo/svn/server/modules/geronimo-activation/
> >> target/classes/META-INF
> >>
> >> [INFO] Copying 2 files to
> >> /home/kanchana/Geronimo/svn/server/modules/geronimo-activation/
> >> target/classes/META-INF
> >>
> >> [INFO] [resources:resources]
> >> [INFO] Using default encoding to copy filtered resources.
> >> [INFO] [compiler:compile]
> >> Compiling 8 source files to
> >> /home/kanchana/Geronimo/svn/server/modules/geronimo-activation/
> >> target/classes
> >>
> >> [INFO] [resources:testResources]
> >> [INFO] Using default encoding to copy filtered resources.
> >> [INFO] [compiler:testCompile]
> >> Compiling 4 source files to
> >> /home/kanchana/Geronimo/svn/server/modules/geronimo-activation/
> >> target/test-classes
> >>
> >> [INFO] [surefire:test]
> >> [INFO] Surefire report directory:
> >> /home/kanchana/Geronimo/svn/server/modules/geronimo-activation/
> >> target/surefire-reports
> >>
> >>
> >> -------------------------------------------------------
> >> T E S T S
> >> -------------------------------------------------------
> >> Running org.apache.geronimo.activation.handlers.TextHtmlTest
> >> Tests run: 3, Failures: 0, Errors: 0, Skipped: 0, Time elapsed:
> >> 0.058 sec
> >> Running org.apache.geronimo.activation.handlers.TextPlainTest
> >> Tests run: 3, Failures: 0, Errors: 0, Skipped: 0, Time elapsed:
> >> 0.015 sec
> >> Running org.apache.geronimo.activation.handlers.TextXmlTest
> >> Tests run: 3, Failures: 0, Errors: 0, Skipped: 0, Time elapsed:
> >> 0.012 sec
> >>
> >> Results :
> >> Tests run: 9, Failures: 0, Errors: 0, Skipped: 0
> >>
> >> [INFO] [jar:jar]
> >> [INFO] Building jar:
> >> /home/kanchana/Geronimo/svn/server/modules/geronimo-activation/
> >> target/geronimo-activation-1.2-SNAPSHOT.jar
> >>
> >> [INFO] [install:install]
> >> [INFO] Installing
> >> /home/kanchana/Geronimo/svn/server/modules/geronimo-activation/
> >> target/geronimo-activation-1.2-SNAPSHOT.jar
> >>
> >> to
> >> /root/.m2/repository/org/apache/geronimo/modules/geronimo-
> >> activation/1.2-SNAPSHOT/geronimo-activation-1.2-SNAPSHOT.jar
> >>
> >> [INFO]
> >> ---------------------------------------------------------------------
> >> -------
> >>
> >> [INFO] Building Geronimo :: ActiveMQ Embedded RAR
> >> [INFO]    task-segment: [clean, install]
> >> [INFO]
> >> ---------------------------------------------------------------------
> >> -------
> >>
> >> [INFO] [clean:clean]
> >> [INFO] Deleting directory
> >> /home/kanchana/Geronimo/svn/server/modules/ge-activemq-rar/target
> >> [INFO] Deleting directory
> >> /home/kanchana/Geronimo/svn/server/modules/ge-activemq-rar/target/
> >> classes
> >> [INFO] Deleting directory
> >> /home/kanchana/Geronimo/svn/server/modules/ge-activemq-rar/target/
> >> test-classes
> >>
> >> [INFO] [tools:require-java-version {execution: validate-java-
> >> version}]
> >> [INFO] [tools:copy-legal-files {execution: install-legal-files}]
> >> [INFO] Created dir:
> >> /home/kanchana/Geronimo/svn/server/modules/ge-activemq-rar/target/
> >> classes/META-INF
> >>
> >> [INFO] Copying 2 files to
> >> /home/kanchana/Geronimo/svn/server/modules/ge-activemq-rar/target/
> >> classes/META-INF
> >>
> >> [INFO] [resources:resources]
> >> [INFO] Using default encoding to copy filtered resources.
> >> Downloading:
> >> http://people.apache.org/repo/m2-snapshot-repository/org/apache/
> >> activemq/activemq-core/4.1-incubator-SNAPSHOT/activemq-core-4.1-
> >> incubator-20060925.071006-49.pom
> >>
> >> [WARNING] Unable to get resource from repository apache-snapshots
> >> (http://people.apache.org/repo/m2-snapshot-repository)
> >> Downloading:
> >> http://snapshots.repository.codehaus.org/org/apache/activemq/
> >> activemq-core/4.1-incubator-SNAPSHOT/activemq-core-4.1-
> >> incubator-20060925.071006-49.pom
> >>
> >> [WARNING] Unable to get resource from repository codehaus-snapshots
> >> (http://snapshots.repository.codehaus.org)
> >> Downloading:
> >> http://people.apache.org/maven-snapshot-repository/org/apache/
> >> activemq/activemq-core/4.1-incubator-SNAPSHOT/activemq-core-4.1-
> >> incubator-20060925.071006-49.pom
> >>
> >> [WARNING] Unable to get resource from repository apache.snapshots
> >> (http://people.apache.org/maven-snapshot-repository)
> >> [INFO] [compiler:compile]
> >> [INFO] No sources to compile
> >> [INFO] [resources:testResources]
> >> [INFO] Using default encoding to copy filtered resources.
> >> [INFO] [compiler:testCompile]
> >> [INFO] No sources to compile
> >> [INFO] [surefire:test]
> >> [INFO] No tests to run.
> >> [INFO] [rar:rar]
> >> [INFO] Copying artifact[org.apache.activemq,
> >> org.apache.activemq:activemq-core:jar:4.1-incubator-SNAPSHOT,
> >> compile]
> >> [INFO] Copying artifact[org.apache.activemq,
> >> org.apache.activemq:activemq-ra:jar:4.1-incubator-20060925.071006-49,
> >> compile]
> >> [INFO] Copy rar resources to
> >> /home/kanchana/Geronimo/svn/server/modules/ge-activemq-rar/target/
> >> ge-activemq-rar-1.2-SNAPSHOT
> >>
> >> [INFO] Using ra.xml
> >> /home/kanchana/Geronimo/svn/server/modules/ge-activemq-rar/src/
> >> main/rar/META-INF/ra.xml
> >>
> >> [INFO] Could not find manifest file:
> >> /home/kanchana/Geronimo/svn/server/modules/ge-activemq-rar/src/
> >> main/rar/META-INF/MANIFEST.MF
> >>
> >> - Generating one
> >> [INFO] Building jar:
> >> /home/kanchana/Geronimo/svn/server/modules/ge-activemq-rar/target/
> >> ge-activemq-rar-1.2-SNAPSHOT.rar
> >>
> >> [INFO] [install:install]
> >> [INFO] Installing
> >> /home/kanchana/Geronimo/svn/server/modules/ge-activemq-rar/target/
> >> ge-activemq-rar-1.2-SNAPSHOT.rar
> >>
> >> to
> >> /root/.m2/repository/org/apache/geronimo/modules/ge-activemq-rar/
> >> 1.2-SNAPSHOT/ge-activemq-rar-1.2-SNAPSHOT.rar
> >>
> >> [INFO]
> >> ---------------------------------------------------------------------
> >> -------
> >>
> >> [INFO] Building Geronimo :: Kernel
> >> [INFO]    task-segment: [clean, install]
> >> [INFO]
> >> ---------------------------------------------------------------------
> >> -------
> >>
> >> [INFO] [clean:clean]
> >> [INFO] Deleting directory
> >> /home/kanchana/Geronimo/svn/server/modules/geronimo-kernel/target
> >> [INFO] Deleting directory
> >> /home/kanchana/Geronimo/svn/server/modules/geronimo-kernel/target/
> >> classes
> >> [INFO] Deleting directory
> >> /home/kanchana/Geronimo/svn/server/modules/geronimo-kernel/target/
> >> test-classes
> >>
> >> [INFO] [tools:require-java-version {execution: validate-java-
> >> version}]
> >> [INFO] [tools:copy-legal-files {execution: install-legal-files}]
> >> [INFO] Created dir:
> >> /home/kanchana/Geronimo/svn/server/modules/geronimo-kernel/target/
> >> classes/META-INF
> >>
> >> [INFO] Copying 2 files to
> >> /home/kanchana/Geronimo/svn/server/modules/geronimo-kernel/target/
> >> classes/META-INF
> >>
> >> [INFO] [resources:resources]
> >> [INFO] Using default encoding to copy filtered resources.
> >> [INFO] [compiler:compile]
> >> Compiling 176 source files to
> >> /home/kanchana/Geronimo/svn/server/modules/geronimo-kernel/target/
> >> classes
> >> [INFO] [resources:testResources]
> >> [INFO] Using default encoding to copy filtered resources.
> >> [INFO] [compiler:testCompile]
> >> Compiling 29 source files to
> >> /home/kanchana/Geronimo/svn/server/modules/geronimo-kernel/target/
> >> test-classes
> >>
> >> [INFO] [surefire:test]
> >> [INFO] Surefire report directory:
> >> /home/kanchana/Geronimo/svn/server/modules/geronimo-kernel/target/
> >> surefire-reports
> >>
> >>
> >> -------------------------------------------------------
> >> T E S T S
> >> -------------------------------------------------------
> >> Running org.apache.geronimo.kernel.config.ConfigurationModelTest
> >> Tests run: 4, Failures: 0, Errors: 0, Skipped: 0, Time elapsed:
> >> 0.107 sec
> >> Running org.apache.geronimo.kernel.ClassloadingTest
> >> Tests run: 10, Failures: 0, Errors: 0, Skipped: 0, Time elapsed:
> >> 0.319
> >> sec
> >> Running org.apache.geronimo.kernel.basic.BasicProxyMapTest
> >> Tests run: 7, Failures: 0, Errors: 0, Skipped: 0, Time elapsed:
> >> 1.063 sec
> >> Running org.apache.geronimo.kernel.BootstrapTest
> >> Tests run: 1, Failures: 0, Errors: 0, Skipped: 0, Time elapsed:
> >> 0.835 sec
> >> Running org.apache.geronimo.kernel.ConfigTest
> >> Tests run: 3, Failures: 0, Errors: 0, Skipped: 0, Time elapsed:
> >> 2.122 sec
> >> Running org.apache.geronimo.gbean.GBeanInfoFactoryTest
> >> Tests run: 4, Failures: 0, Errors: 0, Skipped: 0, Time elapsed:
> >> 0.019 sec
> >> Running org.apache.geronimo.kernel.util.XmlUtilTest
> >> Tests run: 6, Failures: 0, Errors: 0, Skipped: 0, Time elapsed:
> >> 0.141 sec
> >> Running org.apache.geronimo.kernel.management.StateTest
> >> Tests run: 5, Failures: 0, Errors: 0, Skipped: 0, Time elapsed:
> >> 0.009 sec
> >> Running org.apache.geronimo.kernel.config.MultiParentClassLoaderTest
> >> Tests run: 14, Failures: 0, Errors: 0, Skipped: 0, Time elapsed:
> >> 0.73 sec
> >> Running org.apache.geronimo.gbean.GBeanInfoTest
> >> Tests run: 9, Failures: 0, Errors: 0, Skipped: 0, Time elapsed:
> >> 0.015 sec
> >> Running org.apache.geronimo.kernel.repository.ArtifactResolverTest
> >> Tests run: 4, Failures: 0, Errors: 0, Skipped: 0, Time elapsed:
> >> 0.021 sec
> >> Running org.apache.geronimo.kernel.repository.ArtifactManagerTest
> >> Tests run: 3, Failures: 0, Errors: 0, Skipped: 0, Time elapsed:
> >> 0.008 sec
> >> Running org.apache.geronimo.kernel.classloader.UrlResourceFinderTest
> >> Tests run: 9, Failures: 0, Errors: 0, Skipped: 0, Time elapsed:
> >> 0.154 sec
> >> Running org.apache.geronimo.gbean.runtime.GBeanDependencyTest
> >> Tests run: 1, Failures: 0, Errors: 0, Skipped: 0, Time elapsed:
> >> 0.04 sec
> >> Running org.apache.geronimo.kernel.SimpleGBeanTest
> >> Tests run: 1, Failures: 0, Errors: 0, Skipped: 0, Time elapsed:
> >> 0.19 sec
> >> Running org.apache.geronimo.kernel.GBeanTest
> >> Tests run: 18, Failures: 0, Errors: 0, Skipped: 0, Time elapsed:
> >> 1.69 sec
> >> Running org.apache.geronimo.kernel.config.ConfigurationManagerTest
> >> 23:37:41,443 ERROR [GBeanInstanceState] Error while starting;
> >> GBean is
> >> now in the FAILED state:
> >> abstractName="test/3/3.3/bar?j2eeType=GBean,name=gbean3"
> >> java.lang.RuntimeException: FAILING
> >>     at
> >> org.apache.geronimo.kernel.config.ConfigurationManagerTest.checkFail(
> >> ConfigurationManagerTest.java:663)
> >>
> >>     at
> >> org.apache.geronimo.kernel.config.ConfigurationManagerTest.access
> >> $300(ConfigurationManagerTest.java:54)
> >>
> >>     at
> >> org.apache.geronimo.kernel.config.ConfigurationManagerTest
> >> $TestBean.<init>(ConfigurationManagerTest.java:809)
> >>
> >>     at sun.reflect.NativeConstructorAccessorImpl.newInstance0(Native
> >> Method)
> >>     at
> >> sun.reflect.NativeConstructorAccessorImpl.newInstance
> >> (NativeConstructorAccessorImpl.java:39)
> >>
> >>     at
> >> sun.reflect.DelegatingConstructorAccessorImpl.newInstance
> >> (DelegatingConstructorAccessorImpl.java:27)
> >>
> >>     at java.lang.reflect.Constructor.newInstance(Constructor.java:
> >> 274)
> >>     at
> >> org.apache.geronimo.gbean.runtime.GBeanInstance.createInstance
> >> (GBeanInstance.java:936)
> >>
> >>     at
> >> org.apache.geronimo.gbean.runtime.GBeanInstanceState.attemptFullStart
> >> (GBeanInstanceState.java:267)
> >>
> >>     at
> >> org.apache.geronimo.gbean.runtime.GBeanInstanceState.start
> >> (GBeanInstanceState.java:102)
> >>
> >>     at
> >> org.apache.geronimo.gbean.runtime.GBeanInstanceState.startRecursive
> >> (GBeanInstanceState.java:124)
> >>
> >>     at
> >> org.apache.geronimo.gbean.runtime.GBeanInstance.startRecursive
> >> (GBeanInstance.java:543)
> >>
> >>     at
> >> org.apache.geronimo.kernel.basic.BasicKernel.startRecursiveGBean
> >> (BasicKernel.java:379)
> >>
> >>     at
> >> org.apache.geronimo.kernel.config.ConfigurationUtil.startConfiguratio
> >> nGBeans(ConfigurationUtil.java:374)
> >>
> >>     at
> >> org.apache.geronimo.kernel.config.KernelConfigurationManager.start
> >> (KernelConfigurationManager.java:187)
> >>
> >>     at
> >> org.apache.geronimo.kernel.config.SimpleConfigurationManager.restartC
> >> onfiguration(SimpleConfigurationManager.java:628)
> >>
> >>     at
> >> org.apache.geronimo.kernel.config.SimpleConfigurationManager.restartC
> >> onfiguration(SimpleConfigurationManager.java:588)
> >>
> >>     at
> >> org.apache.geronimo.kernel.config.ConfigurationManagerTest.testRestar
> >> tException(ConfigurationManagerTest.java:236)
> >>
> >>     at sun.reflect.NativeMethodAccessorImpl.invoke0(Native Method)
> >>     at
> >> sun.reflect.NativeMethodAccessorImpl.invoke
> >> (NativeMethodAccessorImpl.java:39)
> >>
> >>     at
> >> sun.reflect.DelegatingMethodAccessorImpl.invoke
> >> (DelegatingMethodAccessorImpl.java:25)
> >>
> >>     at java.lang.reflect.Method.invoke(Method.java:324)
> >>     at junit.framework.TestCase.runTest(TestCase.java:154)
> >>     at junit.framework.TestCase.runBare(TestCase.java:127)
> >>     at junit.framework.TestResult$1.protect(TestResult.java:106)
> >>     at junit.framework.TestResult.runProtected(TestResult.java:124)
> >>     at junit.framework.TestResult.run(TestResult.java:109)
> >>     at junit.framework.TestCase.run(TestCase.java:118)
> >>     at junit.framework.TestSuite.runTest(TestSuite.java:208)
> >>     at junit.framework.TestSuite.run(TestSuite.java:203)
> >>     at sun.reflect.GeneratedMethodAccessor17.invoke(Unknown Source)
> >>     at
> >> sun.reflect.DelegatingMethodAccessorImpl.invoke
> >> (DelegatingMethodAccessorImpl.java:25)
> >>
> >>     at java.lang.reflect.Method.invoke(Method.java:324)
> >>     at
> >> org.apache.maven.surefire.junit.JUnitTestSet.execute
> >> (JUnitTestSet.java:210)
> >>
> >>     at
> >> org.apache.maven.surefire.suite.AbstractDirectoryTestSuite.executeTes
> >> tSet(AbstractDirectoryTestSuite.java:135)
> >>
> >>     at
> >> org.apache.maven.surefire.suite.AbstractDirectoryTestSuite.execute
> >> (AbstractDirectoryTestSuite.java:122)
> >>
> >>     at org.apache.maven.surefire.Surefire.run(Surefire.java:129)
> >>     at sun.reflect.NativeMethodAccessorImpl.invoke0(Native Method)
> >>     at
> >> sun.reflect.NativeMethodAccessorImpl.invoke
> >> (NativeMethodAccessorImpl.java:39)
> >>
> >>     at
> >> sun.reflect.DelegatingMethodAccessorImpl.invoke
> >> (DelegatingMethodAccessorImpl.java:25)
> >>
> >>     at java.lang.reflect.Method.invoke(Method.java:324)
> >>     at
> >> org.apache.maven.surefire.booter.SurefireBooter.runSuitesInProcess
> >> (SurefireBooter.java:225)
> >>
> >>     at
> >> org.apache.maven.surefire.booter.SurefireBooter.main
> >> (SurefireBooter.java:747)
> >>
> >> 23:37:41,714 ERROR [GBeanInstanceState] Error while starting;
> >> GBean is
> >> now in the FAILED state:
> >> abstractName="test/3/3.3/bar?j2eeType=GBean,name=gbean3"
> >> java.lang.RuntimeException: FAILING
> >>     at
> >> org.apache.geronimo.kernel.config.ConfigurationManagerTest.checkFail(
> >> ConfigurationManagerTest.java:663)
> >>
> >>     at
> >> org.apache.geronimo.kernel.config.ConfigurationManagerTest.access
> >> $300(ConfigurationManagerTest.java:54)
> >>
> >>     at
> >> org.apache.geronimo.kernel.config.ConfigurationManagerTest
> >> $TestBean.<init>(ConfigurationManagerTest.java:809)
> >>
> >>     at sun.reflect.GeneratedConstructorAccessor58.newInstance(Unknown
> >> Source)
> >>     at
> >> sun.reflect.DelegatingConstructorAccessorImpl.newInstance
> >> (DelegatingConstructorAccessorImpl.java:27)
> >>
> >>     at java.lang.reflect.Constructor.newInstance(Constructor.java:
> >> 274)
> >>     at
> >> org.apache.geronimo.gbean.runtime.GBeanInstance.createInstance
> >> (GBeanInstance.java:936)
> >>
> >>     at
> >> org.apache.geronimo.gbean.runtime.GBeanInstanceState.attemptFullStart
> >> (GBeanInstanceState.java:267)
> >>
> >>     at
> >> org.apache.geronimo.gbean.runtime.GBeanInstanceState.start
> >> (GBeanInstanceState.java:102)
> >>
> >>     at
> >> org.apache.geronimo.gbean.runtime.GBeanInstanceState.startRecursive
> >> (GBeanInstanceState.java:124)
> >>
> >>     at
> >> org.apache.geronimo.gbean.runtime.GBeanInstance.startRecursive
> >> (GBeanInstance.java:543)
> >>
> >>     at
> >> org.apache.geronimo.kernel.basic.BasicKernel.startRecursiveGBean
> >> (BasicKernel.java:379)
> >>
> >>     at
> >> org.apache.geronimo.kernel.config.ConfigurationUtil.startConfiguratio
> >> nGBeans(ConfigurationUtil.java:374)
> >>
> >>     at
> >> org.apache.geronimo.kernel.config.KernelConfigurationManager.start
> >> (KernelConfigurationManager.java:187)
> >>
> >>     at
> >> org.apache.geronimo.kernel.config.SimpleConfigurationManager.reloadCo
> >> nfiguration(SimpleConfigurationManager.java:1141)
> >>
> >>     at
> >> org.apache.geronimo.kernel.config.SimpleConfigurationManager.reloadCo
> >> nfiguration(SimpleConfigurationManager.java:783)
> >>
> >>     at
> >> org.apache.geronimo.kernel.config.SimpleConfigurationManager.reloadCo
> >> nfiguration(SimpleConfigurationManager.java:729)
> >>
> >>     at
> >> org.apache.geronimo.kernel.config.SimpleConfigurationManager.reloadCo
> >> nfiguration(SimpleConfigurationManager.java:725)
> >>
> >>     at
> >> org.apache.geronimo.kernel.config.ConfigurationManagerTest.testReload
> >> Exception(ConfigurationManagerTest.java:383)
> >>
> >>     at sun.reflect.NativeMethodAccessorImpl.invoke0(Native Method)
> >>     at
> >> sun.reflect.NativeMethodAccessorImpl.invoke
> >> (NativeMethodAccessorImpl.java:39)
> >>
> >>     at
> >> sun.reflect.DelegatingMethodAccessorImpl.invoke
> >> (DelegatingMethodAccessorImpl.java:25)
> >>
> >>     at java.lang.reflect.Method.invoke(Method.java:324)
> >>     at junit.framework.TestCase.runTest(TestCase.java:154)
> >>     at junit.framework.TestCase.runBare(TestCase.java:127)
> >>     at junit.framework.TestResult$1.protect(TestResult.java:106)
> >>     at junit.framework.TestResult.runProtected(TestResult.java:124)
> >>     at junit.framework.TestResult.run(TestResult.java:109)
> >>     at junit.framework.TestCase.run(TestCase.java:118)
> >>     at junit.framework.TestSuite.runTest(TestSuite.java:208)
> >>     at junit.framework.TestSuite.run(TestSuite.java:203)
> >>     at sun.reflect.GeneratedMethodAccessor17.invoke(Unknown Source)
> >>     at
> >> sun.reflect.DelegatingMethodAccessorImpl.invoke
> >> (DelegatingMethodAccessorImpl.java:25)
> >>
> >>     at java.lang.reflect.Method.invoke(Method.java:324)
> >>     at
> >> org.apache.maven.surefire.junit.JUnitTestSet.execute
> >> (JUnitTestSet.java:210)
> >>
> >>     at
> >> org.apache.maven.surefire.suite.AbstractDirectoryTestSuite.executeTes
> >> tSet(AbstractDirectoryTestSuite.java:135)
> >>
> >>     at
> >> org.apache.maven.surefire.suite.AbstractDirectoryTestSuite.execute
> >> (AbstractDirectoryTestSuite.java:122)
> >>
> >>     at org.apache.maven.surefire.Surefire.run(Surefire.java:129)
> >>     at sun.reflect.NativeMethodAccessorImpl.invoke0(Native Method)
> >>     at
> >> sun.reflect.NativeMethodAccessorImpl.invoke
> >> (NativeMethodAccessorImpl.java:39)
> >>
> >>     at
> >> sun.reflect.DelegatingMethodAccessorImpl.invoke
> >> (DelegatingMethodAccessorImpl.java:25)
> >>
> >>     at java.lang.reflect.Method.invoke(Method.java:324)
> >>     at
> >> org.apache.maven.surefire.booter.SurefireBooter.runSuitesInProcess
> >> (SurefireBooter.java:225)
> >>
> >>     at
> >> org.apache.maven.surefire.booter.SurefireBooter.main
> >> (SurefireBooter.java:747)
> >>
> >> Tests run: 8, Failures: 0, Errors: 0, Skipped: 0, Time elapsed:
> >> 1.443 sec
> >> Running org.apache.geronimo.kernel.config.ConfigurationUtilTest
> >> Tests run: 1, Failures: 0, Errors: 0, Skipped: 0, Time elapsed:
> >> 1.349 sec
> >> Running org.apache.geronimo.gbean.runtime.GBeanAttributeTest
> >> Tests run: 4, Failures: 0, Errors: 0, Skipped: 0, Time elapsed:
> >> 0.094 sec
> >>
> >> Results :
> >> Tests run: 112, Failures: 0, Errors: 0, Skipped: 0
> >>
> >> [INFO] [jar:jar]
> >> [INFO] Building jar:
> >> /home/kanchana/Geronimo/svn/server/modules/geronimo-kernel/target/
> >> geronimo-kernel-1.2-SNAPSHOT.jar
> >>
> >> [INFO] [install:install]
> >> [INFO] Installing
> >> /home/kanchana/Geronimo/svn/server/modules/geronimo-kernel/target/
> >> geronimo-kernel-1.2-SNAPSHOT.jar
> >>
> >> to
> >> /root/.m2/repository/org/apache/geronimo/modules/geronimo-kernel/
> >> 1.2-SNAPSHOT/geronimo-kernel-1.2-SNAPSHOT.jar
> >>
> >> [INFO]
> >> ---------------------------------------------------------------------
> >> -------
> >>
> >> [INFO] Building Geronimo :: Common
> >> [INFO]    task-segment: [clean, install]
> >> [INFO]
> >> ---------------------------------------------------------------------
> >> -------
> >>
> >> [INFO] [clean:clean]
> >> [INFO] Deleting directory
> >> /home/kanchana/Geronimo/svn/server/modules/geronimo-common/target
> >> [INFO] Deleting directory
> >> /home/kanchana/Geronimo/svn/server/modules/geronimo-common/target/
> >> classes
> >> [INFO] Deleting directory
> >> /home/kanchana/Geronimo/svn/server/modules/geronimo-common/target/
> >> test-classes
> >>
> >> [INFO] [tools:require-java-version {execution: validate-java-
> >> version}]
> >> [INFO] [tools:copy-legal-files {execution: install-legal-files}]
> >> [INFO] Created dir:
> >> /home/kanchana/Geronimo/svn/server/modules/geronimo-common/target/
> >> classes/META-INF
> >>
> >> [INFO] Copying 2 files to
> >> /home/kanchana/Geronimo/svn/server/modules/geronimo-common/target/
> >> classes/META-INF
> >>
> >> [INFO] [resources:resources]
> >> [INFO] Using default encoding to copy filtered resources.
> >> [INFO] [compiler:compile]
> >> Compiling 44 source files to
> >> /home/kanchana/Geronimo/svn/server/modules/geronimo-common/target/
> >> classes
> >> [INFO] [resources:testResources]
> >> [INFO] Using default encoding to copy filtered resources.
> >> [INFO] [compiler:testCompile]
> >> Compiling 17 source files to
> >> /home/kanchana/Geronimo/svn/server/modules/geronimo-common/target/
> >> test-classes
> >>
> >> [INFO] [surefire:test]
> >> [INFO] Surefire report directory:
> >> /home/kanchana/Geronimo/svn/server/modules/geronimo-common/target/
> >> surefire-reports
> >>
> >>
> >> -------------------------------------------------------
> >> T E S T S
> >> -------------------------------------------------------
> >> Running org.apache.geronimo.common.propertyeditor.SetEditorTest
> >> Tests run: 5, Failures: 0, Errors: 0, Skipped: 0, Time elapsed:
> >> 0.085 sec
> >> Running org.apache.geronimo.common.propertyeditor.TreeSetEditorTest
> >> Tests run: 5, Failures: 0, Errors: 0, Skipped: 0, Time elapsed:
> >> 0.031 sec
> >> Running org.apache.geronimo.common.propertyeditor.ListEditorTest
> >> Tests run: 5, Failures: 0, Errors: 0, Skipped: 0, Time elapsed:
> >> 0.019 sec
> >> Running org.apache.geronimo.common.GeronimoEnvironmentTest
> >> Tests run: 1, Failures: 0, Errors: 0, Skipped: 0, Time elapsed:
> >> 0.13 sec
> >> Running org.apache.geronimo.common.propertyeditor.StackEditorTest
> >> Tests run: 5, Failures: 0, Errors: 0, Skipped: 0, Time elapsed:
> >> 0.032 sec
> >> Running org.apache.geronimo.common.propertyeditor.URLEditorTest
> >> Tests run: 5, Failures: 0, Errors: 0, Skipped: 0, Time elapsed:
> >> 4.936 sec
> >> Running
> >> org.apache.geronimo.common.propertyeditor.CollectionEditorTest
> >> Tests run: 5, Failures: 0, Errors: 0, Skipped: 0, Time elapsed:
> >> 0.024 sec
> >> Running
> >> org.apache.geronimo.common.propertyeditor.PropertiesEditorTest
> >> Tests run: 4, Failures: 0, Errors: 0, Skipped: 0, Time elapsed:
> >> 0.303 sec
> >> Running
> >> org.apache.geronimo.common.propertyeditor.LinkedListEditorTest
> >> Tests run: 5, Failures: 0, Errors: 0, Skipped: 0, Time elapsed:
> >> 0.037 sec
> >> Running
> >> org.apache.geronimo.common.propertyeditor.ArrayPropertyEditorAdapterT
> >> est
> >> Tests run: 2, Failures: 0, Errors: 0, Skipped: 0, Time elapsed:
> >> 0.024 sec
> >> Running org.apache.geronimo.common.propertyeditor.VectorEditorTest
> >> Tests run: 5, Failures: 0, Errors: 0, Skipped: 0, Time elapsed:
> >> 0.02 sec
> >> Running org.apache.geronimo.common.propertyeditor.ArrayListEditorTest
> >> Tests run: 5, Failures: 0, Errors: 0, Skipped: 0, Time elapsed:
> >> 0.042 sec
> >> Running org.apache.geronimo.common.DeploymentExceptionTest
> >> Tests run: 1, Failures: 0, Errors: 0, Skipped: 0, Time elapsed:
> >> 0.075 sec
> >> Running org.apache.geronimo.common.propertyeditor.PropertyEditorsTest
> >> Tests run: 2, Failures: 0, Errors: 0, Skipped: 0, Time elapsed:
> >> 0.019 sec
> >> Running org.apache.geronimo.common.propertyeditor.HashSetEditorTest
> >> Tests run: 5, Failures: 0, Errors: 0, Skipped: 0, Time elapsed:
> >> 0.029 sec
> >>
> >> Results :
> >> Tests run: 60, Failures: 0, Errors: 0, Skipped: 0
> >>
> >> [INFO] [jar:jar]
> >> [INFO] Building jar:
> >> /home/kanchana/Geronimo/svn/server/modules/geronimo-common/target/
> >> geronimo-common-1.2-SNAPSHOT.jar
> >>
> >> [INFO] [install:install]
> >> [INFO] Installing
> >> /home/kanchana/Geronimo/svn/server/modules/geronimo-common/target/
> >> geronimo-common-1.2-SNAPSHOT.jar
> >>
> >> to
> >> /root/.m2/repository/org/apache/geronimo/modules/geronimo-common/
> >> 1.2-SNAPSHOT/geronimo-common-1.2-SNAPSHOT.jar
> >>
> >> [INFO]
> >> ---------------------------------------------------------------------
> >> -------
> >>
> >> [INFO] Building Geronimo :: Util
> >> [INFO]    task-segment: [clean, install]
> >> [INFO]
> >> ---------------------------------------------------------------------
> >> -------
> >>
> >> [INFO] [clean:clean]
> >> [INFO] Deleting directory
> >> /home/kanchana/Geronimo/svn/server/modules/geronimo-util/target
> >> [INFO] Deleting directory
> >> /home/kanchana/Geronimo/svn/server/modules/geronimo-util/target/
> >> classes
> >> [INFO] Deleting directory
> >> /home/kanchana/Geronimo/svn/server/modules/geronimo-util/target/
> >> test-classes
> >>
> >> [INFO] [tools:require-java-version {execution: validate-java-
> >> version}]
> >> [INFO] [tools:copy-legal-files {execution: install-legal-files}]
> >> [INFO] Created dir:
> >> /home/kanchana/Geronimo/svn/server/modules/geronimo-util/target/
> >> classes/META-INF
> >>
> >> [INFO] Copying 2 files to
> >> /home/kanchana/Geronimo/svn/server/modules/geronimo-util/target/
> >> classes/META-INF
> >>
> >> [INFO] [resources:resources]
> >> [INFO] Using default encoding to copy filtered resources.
> >> [INFO] [compiler:compile]
> >> Compiling 175 source files to
> >> /home/kanchana/Geronimo/svn/server/modules/geronimo-util/target/
> >> classes
> >> [INFO] [resources:testResources]
> >> [INFO] Using default encoding to copy filtered resources.
> >> [INFO] [compiler:testCompile]
> >> Compiling 1 source file to
> >> /home/kanchana/Geronimo/svn/server/modules/geronimo-util/target/
> >> test-classes
> >>
> >> [INFO] [surefire:test]
> >> [INFO] Surefire report directory:
> >> /home/kanchana/Geronimo/svn/server/modules/geronimo-util/target/
> >> surefire-reports
> >>
> >>
> >> -------------------------------------------------------
> >> T E S T S
> >> -------------------------------------------------------
> >> Running org.apache.geronimo.util.SimpleEncryptionTest
> >> Tests run: 1, Failures: 0, Errors: 0, Skipped: 0, Time elapsed:
> >> 3.946 sec
> >>
> >> Results :
> >> Tests run: 1, Failures: 0, Errors: 0, Skipped: 0
> >>
> >> [INFO] [jar:jar]
> >> [INFO] Building jar:
> >> /home/kanchana/Geronimo/svn/server/modules/geronimo-util/target/
> >> geronimo-util-1.2-SNAPSHOT.jar
> >>
> >> [INFO] [install:install]
> >> [INFO] Installing
> >> /home/kanchana/Geronimo/svn/server/modules/geronimo-util/target/
> >> geronimo-util-1.2-SNAPSHOT.jar
> >>
> >> to
> >> /root/.m2/repository/org/apache/geronimo/modules/geronimo-util/1.2-
> >> SNAPSHOT/geronimo-util-1.2-SNAPSHOT.jar
> >>
> >> [INFO]
> >> ---------------------------------------------------------------------
> >> -------
> >>
> >> [INFO] Building Geronimo :: System
> >> [INFO]    task-segment: [clean, install]
> >> [INFO]
> >> ---------------------------------------------------------------------
> >> -------
> >>
> >> [INFO] [clean:clean]
> >> [INFO] Deleting directory
> >> /home/kanchana/Geronimo/svn/server/modules/geronimo-system/target
> >> [INFO] Deleting directory
> >> /home/kanchana/Geronimo/svn/server/modules/geronimo-system/target/
> >> classes
> >> [INFO] Deleting directory
> >> /home/kanchana/Geronimo/svn/server/modules/geronimo-system/target/
> >> test-classes
> >>
> >> [INFO] [tools:require-java-version {execution: validate-java-
> >> version}]
> >> [INFO] [tools:copy-legal-files {execution: install-legal-files}]
> >> [INFO] Created dir:
> >> /home/kanchana/Geronimo/svn/server/modules/geronimo-system/target/
> >> classes/META-INF
> >>
> >> [INFO] Copying 2 files to
> >> /home/kanchana/Geronimo/svn/server/modules/geronimo-system/target/
> >> classes/META-INF
> >>
> >> [INFO] [antrun:run {execution: generate-dynamic-properties}]
> >> [INFO] Executing tasks
> >>    [mkdir] Created dir:
> >> /home/kanchana/Geronimo/svn/server/modules/geronimo-system/target/
> >> classes/org/apache/geronimo/system/serverinfo
> >>
> >> [propertyfile] Creating new property file:
> >> /home/kanchana/Geronimo/svn/server/modules/geronimo-system/target/
> >> classes/org/apache/geronimo/system/serverinfo/geronimo-
> >> version.properties
> >>
> >> [INFO] Executed tasks
> >> [INFO] [resources:resources]
> >> [INFO] Using default encoding to copy filtered resources.
> >> [INFO] [compiler:compile]
> >> Compiling 79 source files to
> >> /home/kanchana/Geronimo/svn/server/modules/geronimo-system/target/
> >> classes
> >> [INFO] [antrun:run {execution: test-resources}]
> >> [INFO] Executing tasks
> >>    [mkdir] Created dir:
> >> /home/kanchana/Geronimo/svn/server/modules/geronimo-system/target/tmp
> >>    [mkdir] Created dir:
> >> /home/kanchana/Geronimo/svn/server/modules/geronimo-system/target/m1
> >>     [copy] Copying 4 files to
> >> /home/kanchana/Geronimo/svn/server/modules/geronimo-system/target/m1
> >>    [mkdir] Created dir:
> >> /home/kanchana/Geronimo/svn/server/modules/geronimo-system/target/m2
> >>     [copy] Copying 4 files to
> >> /home/kanchana/Geronimo/svn/server/modules/geronimo-system/target/m2
> >> [INFO] Executed tasks
> >> [INFO] [resources:testResources]
> >> [INFO] Using default encoding to copy filtered resources.
> >> [INFO] [compiler:testCompile]
> >> Compiling 16 source files to
> >> /home/kanchana/Geronimo/svn/server/modules/geronimo-system/target/
> >> test-classes
> >>
> >> [INFO] [surefire:test]
> >> [INFO] Surefire report directory:
> >> /home/kanchana/Geronimo/svn/server/modules/geronimo-system/target/
> >> surefire-reports
> >>
> >>
> >> -------------------------------------------------------
> >> T E S T S
> >> -------------------------------------------------------
> >> Running org.apache.geronimo.system.logging.log4j.XLevelTest
> >> Tests run: 4, Failures: 0, Errors: 0, Skipped: 0, Time elapsed:
> >> 0.046 sec
> >> Running
> >> org.apache.geronimo.system.configuration.InPlaceConfigurationUtilTest
> >> Tests run: 3, Failures: 0, Errors: 0, Skipped: 0, Time elapsed:
> >> 0.07 sec
> >> Running org.apache.geronimo.system.repository.Maven1RepositoryTest
> >> Tests run: 10, Failures: 0, Errors: 0, Skipped: 0, Time elapsed:
> >> 0.092
> >> sec
> >> Running
> >> org.apache.geronimo.system.configuration.ConfigurationStoreUtilTest
> >> 23:38:26,690 ERROR [ConfigurationStoreUtil] Checksum file was empty:
> >> /home/kanchana/Geronimo/svn/server/modules/geronimo-system/target/
> >> checksumTest/test.data.sha1
> >>
> >> Tests run: 4, Failures: 0, Errors: 0, Skipped: 0, Time elapsed:
> >> 0.031 sec
> >> Running org.apache.geronimo.system.rmi.RMIClassLoaderSpiImplTest
> >> Tests run: 3, Failures: 0, Errors: 0, Skipped: 0, Time elapsed:
> >> 0.066 sec
> >> Running org.apache.geronimo.system.properties.NamingPropertiesTest
> >> Something is wrong, initial context can be constructed
> >> Tests run: 1, Failures: 0, Errors: 0, Skipped: 0, Time elapsed:
> >> 0.214 sec
> >> Running org.apache.geronimo.system.serverinfo.ServerInfoTest
> >> Tests run: 5, Failures: 0, Errors: 0, Skipped: 0, Time elapsed:
> >> 0.019 sec
> >> Running org.apache.geronimo.system.repository.Maven2RepositoryTest
> >> Tests run: 10, Failures: 0, Errors: 0, Skipped: 0, Time elapsed:
> >> 0.044
> >> sec
> >> Running org.apache.geronimo.system.configuration.ServerOverrideTest
> >> Tests run: 4, Failures: 0, Errors: 0, Skipped: 0, Time elapsed:
> >> 0.666 sec
> >> Running org.apache.geronimo.system.plugin.PluginInstallerTest
> >> Tests run: 1, Failures: 0, Errors: 0, Skipped: 0, Time elapsed:
> >> 0.643 sec
> >> Running
> >> org.apache.geronimo.system.configuration.LocalAttributeManagerTest
> >> Tests run: 7, Failures: 0, Errors: 0, Skipped: 0, Time elapsed:
> >> 0.058 sec
> >>
> >> Results :
> >> Tests run: 52, Failures: 0, Errors: 0, Skipped: 0
> >>
> >> [INFO] [jar:jar]
> >> [INFO] Building jar:
> >> /home/kanchana/Geronimo/svn/server/modules/geronimo-system/target/
> >> geronimo-system-1.2-SNAPSHOT.jar
> >>
> >> [INFO] [install:install]
> >> [INFO] Installing
> >> /home/kanchana/Geronimo/svn/server/modules/geronimo-system/target/
> >> geronimo-system-1.2-SNAPSHOT.jar
> >>
> >> to
> >> /root/.m2/repository/org/apache/geronimo/modules/geronimo-system/
> >> 1.2-SNAPSHOT/geronimo-system-1.2-SNAPSHOT.jar
> >>
> >> [INFO]
> >> ---------------------------------------------------------------------
> >> -------
> >>
> >> [INFO] Building Geronimo :: Management API
> >> [INFO]    task-segment: [clean, install]
> >> [INFO]
> >> ---------------------------------------------------------------------
> >> -------
> >>
> >> [INFO] [clean:clean]
> >> [INFO] Deleting directory
> >> /home/kanchana/Geronimo/svn/server/modules/geronimo-management/target
> >> [INFO] Deleting directory
> >> /home/kanchana/Geronimo/svn/server/modules/geronimo-management/
> >> target/classes
> >>
> >> [INFO] Deleting directory
> >> /home/kanchana/Geronimo/svn/server/modules/geronimo-management/
> >> target/test-classes
> >>
> >> [INFO] [tools:require-java-version {execution: validate-java-
> >> version}]
> >> [INFO] [tools:copy-legal-files {execution: install-legal-files}]
> >> [INFO] Created dir:
> >> /home/kanchana/Geronimo/svn/server/modules/geronimo-management/
> >> target/classes/META-INF
> >>
> >> [INFO] Copying 2 files to
> >> /home/kanchana/Geronimo/svn/server/modules/geronimo-management/
> >> target/classes/META-INF
> >>
> >> [INFO] [resources:resources]
> >> [INFO] Using default encoding to copy filtered resources.
> >> [INFO] [compiler:compile]
> >> Compiling 76 source files to
> >> /home/kanchana/Geronimo/svn/server/modules/geronimo-management/
> >> target/classes
> >>
> >> [INFO] [resources:testResources]
> >> [INFO] Using default encoding to copy filtered resources.
> >> [INFO] [compiler:testCompile]
> >> [INFO] No sources to compile
> >> [INFO] [surefire:test]
> >> [INFO] No tests to run.
> >> [INFO] [jar:jar]
> >> [INFO] Building jar:
> >> /home/kanchana/Geronimo/svn/server/modules/geronimo-management/
> >> target/geronimo-management-1.2-SNAPSHOT.jar
> >>
> >> [INFO] [install:install]
> >> [INFO] Installing
> >> /home/kanchana/Geronimo/svn/server/modules/geronimo-management/
> >> target/geronimo-management-1.2-SNAPSHOT.jar
> >>
> >> to
> >> /root/.m2/repository/org/apache/geronimo/modules/geronimo-
> >> management/1.2-SNAPSHOT/geronimo-management-1.2-SNAPSHOT.jar
> >>
> >> [INFO]
> >> ---------------------------------------------------------------------
> >> -------
> >>
> >> [INFO] Building Geronimo :: ActiveMQ GBean Management Interfaces
> >> [INFO]    task-segment: [clean, install]
> >> [INFO]
> >> ---------------------------------------------------------------------
> >> -------
> >>
> >> [INFO] [clean:clean]
> >> [INFO] Deleting directory
> >> /home/kanchana/Geronimo/svn/server/modules/geronimo-activemq-gbean-
> >> management/target
> >>
> >> [INFO] Deleting directory
> >> /home/kanchana/Geronimo/svn/server/modules/geronimo-activemq-gbean-
> >> management/target/classes
> >>
> >> [INFO] Deleting directory
> >> /home/kanchana/Geronimo/svn/server/modules/geronimo-activemq-gbean-
> >> management/target/test-classes
> >>
> >> [INFO] [tools:require-java-version {execution: validate-java-
> >> version}]
> >> [INFO] [tools:copy-legal-files {execution: install-legal-files}]
> >> [INFO] Created dir:
> >> /home/kanchana/Geronimo/svn/server/modules/geronimo-activemq-gbean-
> >> management/target/classes/META-INF
> >>
> >> [INFO] Copying 2 files to
> >> /home/kanchana/Geronimo/svn/server/modules/geronimo-activemq-gbean-
> >> management/target/classes/META-INF
> >>
> >> [INFO] [resources:resources]
> >> [INFO] Using default encoding to copy filtered resources.
> >> [INFO] [compiler:compile]
> >> Compiling 3 source files to
> >> /home/kanchana/Geronimo/svn/server/modules/geronimo-activemq-gbean-
> >> management/target/classes
> >>
> >> [INFO] [resources:testResources]
> >> [INFO] Using default encoding to copy filtered resources.
> >> [INFO] [compiler:testCompile]
> >> [INFO] No sources to compile
> >> [INFO] [surefire:test]
> >> [INFO] No tests to run.
> >> [INFO] [jar:jar]
> >> [INFO] Building jar:
> >> /home/kanchana/Geronimo/svn/server/modules/geronimo-activemq-gbean-
> >> management/target/geronimo-activemq-gbean-management-1.2-SNAPSHOT.jar
> >>
> >> [INFO] [install:install]
> >> [INFO] Installing
> >> /home/kanchana/Geronimo/svn/server/modules/geronimo-activemq-gbean-
> >> management/target/geronimo-activemq-gbean-management-1.2-SNAPSHOT.jar
> >>
> >> to
> >> /root/.m2/repository/org/apache/geronimo/modules/geronimo-activemq-
> >> gbean-management/1.2-SNAPSHOT/geronimo-activemq-gbean-
> >> management-1.2-SNAPSHOT.jar
> >>
> >> [INFO]
> >> ---------------------------------------------------------------------
> >> -------
> >>
> >> [INFO] Building Geronimo :: J2EE
> >> [INFO]    task-segment: [clean, install]
> >> [INFO]
> >> ---------------------------------------------------------------------
> >> -------
> >>
> >> [INFO] [clean:clean]
> >> [INFO] Deleting directory
> >> /home/kanchana/Geronimo/svn/server/modules/geronimo-j2ee/target
> >> [INFO] Deleting directory
> >> /home/kanchana/Geronimo/svn/server/modules/geronimo-j2ee/target/
> >> classes
> >> [INFO] Deleting directory
> >> /home/kanchana/Geronimo/svn/server/modules/geronimo-j2ee/target/
> >> test-classes
> >>
> >> [INFO] [tools:require-java-version {execution: validate-java-
> >> version}]
> >> [INFO] [tools:copy-legal-files {execution: install-legal-files}]
> >> [INFO] Created dir:
> >> /home/kanchana/Geronimo/svn/server/modules/geronimo-j2ee/target/
> >> classes/META-INF
> >>
> >> [INFO] Copying 2 files to
> >> /home/kanchana/Geronimo/svn/server/modules/geronimo-j2ee/target/
> >> classes/META-INF
> >>
> >> [INFO] [resources:resources]
> >> [INFO] Using default encoding to copy filtered resources.
> >> [INFO] [compiler:compile]
> >> Compiling 11 source files to
> >> /home/kanchana/Geronimo/svn/server/modules/geronimo-j2ee/target/
> >> classes
> >> [INFO] [resources:testResources]
> >> [INFO] Using default encoding to copy filtered resources.
> >> [INFO] [compiler:testCompile]
> >> Compiling 4 source files to
> >> /home/kanchana/Geronimo/svn/server/modules/geronimo-j2ee/target/
> >> test-classes
> >>
> >> [INFO] [surefire:test]
> >> [INFO] Surefire report directory:
> >> /home/kanchana/Geronimo/svn/server/modules/geronimo-j2ee/target/
> >> surefire-reports
> >>
> >>
> >> -------------------------------------------------------
> >> T E S T S
> >> -------------------------------------------------------
> >> Running org.apache.geronimo.j2ee.management.DomainTest
> >> Tests run: 2, Failures: 0, Errors: 0, Skipped: 0, Time elapsed:
> >> 1.055 sec
> >> Running org.apache.geronimo.j2ee.management.ServerTest
> >> Tests run: 2, Failures: 0, Errors: 0, Skipped: 0, Time elapsed:
> >> 0.157 sec
> >> Running org.apache.geronimo.j2ee.management.JVMTest
> >> Tests run: 5, Failures: 0, Errors: 0, Skipped: 0, Time elapsed:
> >> 0.295 sec
> >>
> >> Results :
> >> Tests run: 9, Failures: 0, Errors: 0, Skipped: 0
> >>
> >> [INFO] [jar:jar]
> >> [INFO] Building jar:
> >> /home/kanchana/Geronimo/svn/server/modules/geronimo-j2ee/target/
> >> geronimo-j2ee-1.2-SNAPSHOT.jar
> >>
> >> [INFO] [install:install]
> >> [INFO] Installing
> >> /home/kanchana/Geronimo/svn/server/modules/geronimo-j2ee/target/
> >> geronimo-j2ee-1.2-SNAPSHOT.jar
> >>
> >> to
> >> /root/.m2/repository/org/apache/geronimo/modules/geronimo-j2ee/1.2-
> >> SNAPSHOT/geronimo-j2ee-1.2-SNAPSHOT.jar
> >>
> >> [INFO]
> >> ---------------------------------------------------------------------
> >> -------
> >>
> >> [INFO] Building Geronimo :: Interceptor
> >> [INFO]    task-segment: [clean, install]
> >> [INFO]
> >> ---------------------------------------------------------------------
> >> -------
> >>
> >> [INFO] [clean:clean]
> >> [INFO] Deleting directory
> >> /home/kanchana/Geronimo/svn/server/modules/geronimo-interceptor/
> >> target
> >> [INFO] Deleting directory
> >> /home/kanchana/Geronimo/svn/server/modules/geronimo-interceptor/
> >> target/classes
> >>
> >> [INFO] Deleting directory
> >> /home/kanchana/Geronimo/svn/server/modules/geronimo-interceptor/
> >> target/test-classes
> >>
> >> [INFO] [tools:require-java-version {execution: validate-java-
> >> version}]
> >> [INFO] [tools:copy-legal-files {execution: install-legal-files}]
> >> [INFO] Created dir:
> >> /home/kanchana/Geronimo/svn/server/modules/geronimo-interceptor/
> >> target/classes/META-INF
> >>
> >> [INFO] Copying 2 files to
> >> /home/kanchana/Geronimo/svn/server/modules/geronimo-interceptor/
> >> target/classes/META-INF
> >>
> >> [INFO] [resources:resources]
> >> [INFO] Using default encoding to copy filtered resources.
> >> [INFO] [compiler:compile]
> >> Compiling 5 source files to
> >> /home/kanchana/Geronimo/svn/server/modules/geronimo-interceptor/
> >> target/classes
> >>
> >> [INFO] [resources:testResources]
> >> [INFO] Using default encoding to copy filtered resources.
> >> [INFO] [compiler:testCompile]
> >> [INFO] No sources to compile
> >> [INFO] [surefire:test]
> >> [INFO] No tests to run.
> >> [INFO] [jar:jar]
> >> [INFO] Building jar:
> >> /home/kanchana/Geronimo/svn/server/modules/geronimo-interceptor/
> >> target/geronimo-interceptor-1.2-SNAPSHOT.jar
> >>
> >> [INFO] [install:install]
> >> [INFO] Installing
> >> /home/kanchana/Geronimo/svn/server/modules/geronimo-interceptor/
> >> target/geronimo-interceptor-1.2-SNAPSHOT.jar
> >>
> >> to
> >> /root/.m2/repository/org/apache/geronimo/modules/geronimo-
> >> interceptor/1.2-SNAPSHOT/geronimo-interceptor-1.2-SNAPSHOT.jar
> >>
> >> [INFO]
> >> ---------------------------------------------------------------------
> >> -------
> >>
> >> [INFO] Building Geronimo :: Core
> >> [INFO]    task-segment: [clean, install]
> >> [INFO]
> >> ---------------------------------------------------------------------
> >> -------
> >>
> >> [INFO] [clean:clean]
> >> [INFO] Deleting directory
> >> /home/kanchana/Geronimo/svn/server/modules/geronimo-core/target
> >> [INFO] Deleting directory
> >> /home/kanchana/Geronimo/svn/server/modules/geronimo-core/target/
> >> classes
> >> [INFO] Deleting directory
> >> /home/kanchana/Geronimo/svn/server/modules/geronimo-core/target/
> >> test-classes
> >>
> >> [INFO] [tools:require-java-version {execution: validate-java-
> >> version}]
> >> [INFO] [tools:copy-legal-files {execution: install-legal-files}]
> >> [INFO] Created dir:
> >> /home/kanchana/Geronimo/svn/server/modules/geronimo-core/target/
> >> classes/META-INF
> >>
> >> [INFO] Copying 2 files to
> >> /home/kanchana/Geronimo/svn/server/modules/geronimo-core/target/
> >> classes/META-INF
> >>
> >> [INFO] [resources:resources]
> >> [INFO] Using default encoding to copy filtered resources.
> >> [INFO] [compiler:compile]
> >> Compiling 8 source files to
> >> /home/kanchana/Geronimo/svn/server/modules/geronimo-core/target/
> >> classes
> >> [INFO] [resources:testResources]
> >> [INFO] Using default encoding to copy filtered resources.
> >> [INFO] [compiler:testCompile]
> >> Compiling 1 source file to
> >> /home/kanchana/Geronimo/svn/server/modules/geronimo-core/target/
> >> test-classes
> >>
> >> [INFO] [surefire:test]
> >> [INFO] Surefire report directory:
> >> /home/kanchana/Geronimo/svn/server/modules/geronimo-core/target/
> >> surefire-reports
> >>
> >>
> >> -------------------------------------------------------
> >> T E S T S
> >> -------------------------------------------------------
> >> Running org.apache.geronimo.pool.ThreadPoolTest
> >> Tests run: 1, Failures: 0, Errors: 0, Skipped: 0, Time elapsed:
> >> 0.185 sec
> >>
> >> Results :
> >> Tests run: 1, Failures: 0, Errors: 0, Skipped: 0
> >>
> >> [INFO] [jar:jar]
> >> [INFO] Building jar:
> >> /home/kanchana/Geronimo/svn/server/modules/geronimo-core/target/
> >> geronimo-core-1.2-SNAPSHOT.jar
> >>
> >> [INFO] [install:install]
> >> [INFO] Installing
> >> /home/kanchana/Geronimo/svn/server/modules/geronimo-core/target/
> >> geronimo-core-1.2-SNAPSHOT.jar
> >>
> >> to
> >> /root/.m2/repository/org/apache/geronimo/modules/geronimo-core/1.2-
> >> SNAPSHOT/geronimo-core-1.2-SNAPSHOT.jar
> >>
> >> [INFO]
> >> ---------------------------------------------------------------------
> >> -------
> >>
> >> [INFO] Building Geronimo :: Security
> >> [INFO]    task-segment: [clean, install]
> >> [INFO]
> >> ---------------------------------------------------------------------
> >> -------
> >>
> >> [INFO] [clean:clean]
> >> [INFO] Deleting directory
> >> /home/kanchana/Geronimo/svn/server/modules/geronimo-security/target
> >> [INFO] Deleting directory
> >> /home/kanchana/Geronimo/svn/server/modules/geronimo-security/
> >> target/classes
> >>
> >> [INFO] Deleting directory
> >> /home/kanchana/Geronimo/svn/server/modules/geronimo-security/
> >> target/test-classes
> >>
> >> [INFO] [tools:require-java-version {execution: validate-java-
> >> version}]
> >> [INFO] [tools:copy-legal-files {execution: install-legal-files}]
> >> [INFO] Created dir:
> >> /home/kanchana/Geronimo/svn/server/modules/geronimo-security/
> >> target/classes/META-INF
> >>
> >> [INFO] Copying 2 files to
> >> /home/kanchana/Geronimo/svn/server/modules/geronimo-security/
> >> target/classes/META-INF
> >>
> >> [INFO] [resources:resources]
> >> [INFO] Using default encoding to copy filtered resources.
> >> [INFO] [compiler:compile]
> >> Compiling 103 source files to
> >> /home/kanchana/Geronimo/svn/server/modules/geronimo-security/
> >> target/classes
> >>
> >> [INFO] [resources:testResources]
> >> [INFO] Using default encoding to copy filtered resources.
> >> [INFO] [compiler:testCompile]
> >> Compiling 13 source files to
> >> /home/kanchana/Geronimo/svn/server/modules/geronimo-security/
> >> target/test-classes
> >>
> >> [INFO] [surefire:test]
> >> [INFO] Surefire report directory:
> >> /home/kanchana/Geronimo/svn/server/modules/geronimo-security/
> >> target/surefire-reports
> >>
> >>
> >> -------------------------------------------------------
> >> T E S T S
> >> -------------------------------------------------------
> >> Running
> >> org.apache.geronimo.security.network.protocol.SubjectCarryingProtocol
> >> Test
> >> 23:38:52,818 ERROR [GBeanInstanceState] Error while starting;
> >> GBean is
> >> now in the FAILED state:
> >> abstractName="test/foo/1/car?name=JaasLoginServiceRemotingServer"
> >> java.net.BindException: Address already in use
> >>     at java.net.PlainSocketImpl.socketBind(Native Method)
> >>     at java.net.PlainSocketImpl.bind(PlainSocketImpl.java:331)
> >>     at java.net.ServerSocket.bind(ServerSocket.java:318)
> >>     at java.net.ServerSocket.<init>(ServerSocket.java:185)
> >>     at
> >> javax.net.DefaultServerSocketFactory.createServerSocket(DashoA12275)
> >>     at
> >> org.activeio.net.SocketStreamChannelFactory.bindStreamChannel
> >> (SocketStreamChannelFactory.java:96)
> >>
> >>     at
> >> org.activeio.net.SocketSyncChannelFactory.bindSyncChannel
> >> (SocketSyncChannelFactory.java:74)
> >>
> >>     at
> >> org.apache.geronimo.security.remoting.jmx.JaasLoginServiceRemotingSer
> >> ver.createAsyncChannelServer(JaasLoginServiceRemotingServer.java:148)
> >>
> >>     at
> >> org.apache.geronimo.security.remoting.jmx.JaasLoginServiceRemotingSer
> >> ver.doStart(JaasLoginServiceRemotingServer.java:114)
> >>
> >>     at
> >> org.apache.geronimo.gbean.runtime.GBeanInstance.createInstance
> >> (GBeanInstance.java:984)
> >>
> >>     at
> >> org.apache.geronimo.gbean.runtime.GBeanInstanceState.attemptFullStart
> >> (GBeanInstanceState.java:267)
> >>
> >>     at
> >> org.apache.geronimo.gbean.runtime.GBeanInstanceState.start
> >> (GBeanInstanceState.java:102)
> >>
> >>     at
> >> org.apache.geronimo.gbean.runtime.GBeanInstance.start
> >> (GBeanInstance.java:529)
> >>
> >>     at
> >> org.apache.geronimo.gbean.runtime.GBeanDependency.attemptFullStart
> >> (GBeanDependency.java:111)
> >>
> >>     at
> >> org.apache.geronimo.gbean.runtime.GBeanDependency.addTarget
> >> (GBeanDependency.java:146)
> >>
> >>     at
> >> org.apache.geronimo.gbean.runtime.GBeanDependency$1.running
> >> (GBeanDependency.java:120)
> >>
> >>     at
> >> org.apache.geronimo.kernel.basic.BasicLifecycleMonitor.fireRunningEve
> >> nt(BasicLifecycleMonitor.java:173)
> >>
> >>     at
> >> org.apache.geronimo.kernel.basic.BasicLifecycleMonitor.access$300
> >> (BasicLifecycleMonitor.java:41)
> >>
> >>     at
> >> org.apache.geronimo.kernel.basic.BasicLifecycleMonitor
> >> $RawLifecycleBroadcaster.fireRunningEvent
> >> (BasicLifecycleMonitor.java:251)
> >>
> >>     at
> >> org.apache.geronimo.gbean.runtime.GBeanInstanceState.attemptFullStart
> >> (GBeanInstanceState.java:292)
> >>
> >>     at
> >> org.apache.geronimo.gbean.runtime.GBeanInstanceState.start
> >> (GBeanInstanceState.java:102)
> >>
> >>     at
> >> org.apache.geronimo.gbean.runtime.GBeanInstance.start
> >> (GBeanInstance.java:529)
> >>
> >>     at
> >> org.apache.geronimo.kernel.basic.BasicKernel.startGBean
> >> (BasicKernel.java:361)
> >>
> >>     at
> >> org.apache.geronimo.security.AbstractTest.setUp(AbstractTest.java:
> >> 128)
> >>     at
> >> org.apache.geronimo.security.network.protocol.SubjectCarryingProtocol
> >> Test.setUp(SubjectCarryingProtocolTest.java:113)
> >>
> >>     at junit.framework.TestCase.runBare(TestCase.java:125)
> >>     at junit.framework.TestResult$1.protect(TestResult.java:106)
> >>     at junit.framework.TestResult.runProtected(TestResult.java:124)
> >>     at junit.framework.TestResult.run(TestResult.java:109)
> >>     at junit.framework.TestCase.run(TestCase.java:118)
> >>     at junit.framework.TestSuite.runTest(TestSuite.java:208)
> >>     at junit.framework.TestSuite.run(TestSuite.java:203)
> >>     at sun.reflect.NativeMethodAccessorImpl.invoke0(Native Method)
> >>     at
> >> sun.reflect.NativeMethodAccessorImpl.invoke
> >> (NativeMethodAccessorImpl.java:39)
> >>
> >>     at
> >> sun.reflect.DelegatingMethodAccessorImpl.invoke
> >> (DelegatingMethodAccessorImpl.java:25)
> >>
> >>     at java.lang.reflect.Method.invoke(Method.java:324)
> >>     at
> >> org.apache.maven.surefire.junit.JUnitTestSet.execute
> >> (JUnitTestSet.java:210)
> >>
> >>     at
> >> org.apache.maven.surefire.suite.AbstractDirectoryTestSuite.executeTes
> >> tSet(AbstractDirectoryTestSuite.java:135)
> >>
> >>     at
> >> org.apache.maven.surefire.suite.AbstractDirectoryTestSuite.execute
> >> (AbstractDirectoryTestSuite.java:122)
> >>
> >>     at org.apache.maven.surefire.Surefire.run(Surefire.java:129)
> >>     at sun.reflect.NativeMethodAccessorImpl.invoke0(Native Method)
> >>     at
> >> sun.reflect.NativeMethodAccessorImpl.invoke
> >> (NativeMethodAccessorImpl.java:39)
> >>
> >>     at
> >> sun.reflect.DelegatingMethodAccessorImpl.invoke
> >> (DelegatingMethodAccessorImpl.java:25)
> >>
> >>     at java.lang.reflect.Method.invoke(Method.java:324)
> >>     at
> >> org.apache.maven.surefire.booter.SurefireBooter.runSuitesInProcess
> >> (SurefireBooter.java:225)
> >>
> >>     at
> >> org.apache.maven.surefire.booter.SurefireBooter.main
> >> (SurefireBooter.java:747)
> >>
> >> 23:38:52,951 ERROR [GBeanInstanceState] Error while starting;
> >> GBean is
> >> now in the FAILED state:
> >> abstractName="test/foo/1/car?name=JaasLoginServiceRemotingServer"
> >> java.net.BindException: Address already in use
> >>     at java.net.PlainSocketImpl.socketBind(Native Method)
> >>     at java.net.PlainSocketImpl.bind(PlainSocketImpl.java:331)
> >>     at java.net.ServerSocket.bind(ServerSocket.java:318)
> >>     at java.net.ServerSocket.<init>(ServerSocket.java:185)
> >>     at
> >> javax.net.DefaultServerSocketFactory.createServerSocket(DashoA12275)
> >>     at
> >> org.activeio.net.SocketStreamChannelFactory.bindStreamChannel
> >> (SocketStreamChannelFactory.java:96)
> >>
> >>     at
> >> org.activeio.net.SocketSyncChannelFactory.bindSyncChannel
> >> (SocketSyncChannelFactory.java:74)
> >>
> >>     at
> >> org.apache.geronimo.security.remoting.jmx.JaasLoginServiceRemotingSer
> >> ver.createAsyncChannelServer(JaasLoginServiceRemotingServer.java:148)
> >>
> >>     at
> >> org.apache.geronimo.security.remoting.jmx.JaasLoginServiceRemotingSer
> >> ver.doStart(JaasLoginServiceRemotingServer.java:114)
> >>
> >>     at
> >> org.apache.geronimo.gbean.runtime.GBeanInstance.createInstance
> >> (GBeanInstance.java:984)
> >>
> >>     at
> >> org.apache.geronimo.gbean.runtime.GBeanInstanceState.attemptFullStart
> >> (GBeanInstanceState.java:267)
> >>
> >>     at
> >> org.apache.geronimo.gbean.runtime.GBeanInstanceState.start
> >> (GBeanInstanceState.java:102)
> >>
> >>     at
> >> org.apache.geronimo.gbean.runtime.GBeanInstance.start
> >> (GBeanInstance.java:529)
> >>
> >>     at
> >> org.apache.geronimo.kernel.basic.BasicKernel.startGBean
> >> (BasicKernel.java:361)
> >>
> >>     at
> >> org.apache.geronimo.security.AbstractTest.setUp(AbstractTest.java:
> >> 132)
> >>     at
> >> org.apache.geronimo.security.network.protocol.SubjectCarryingProtocol
> >> Test.setUp(SubjectCarryingProtocolTest.java:113)
> >>
> >>     at junit.framework.TestCase.runBare(TestCase.java:125)
> >>     at junit.framework.TestResult$1.protect(TestResult.java:106)
> >>     at junit.framework.TestResult.runProtected(TestResult.java:124)
> >>     at junit.framework.TestResult.run(TestResult.java:109)
> >>     at junit.framework.TestCase.run(TestCase.java:118)
> >>     at junit.framework.TestSuite.runTest(TestSuite.java:208)
> >>     at junit.framework.TestSuite.run(TestSuite.java:203)
> >>     at sun.reflect.NativeMethodAccessorImpl.invoke0(Native Method)
> >>     at
> >> sun.reflect.NativeMethodAccessorImpl.invoke
> >> (NativeMethodAccessorImpl.java:39)
> >>
> >>     at
> >> sun.reflect.DelegatingMethodAccessorImpl.invoke
> >> (DelegatingMethodAccessorImpl.java:25)
> >>
> >>     at java.lang.reflect.Method.invoke(Method.java:324)
> >>     at
> >> org.apache.maven.surefire.junit.JUnitTestSet.execute
> >> (JUnitTestSet.java:210)
> >>
> >>     at
> >> org.apache.maven.surefire.suite.AbstractDirectoryTestSuite.executeTes
> >> tSet(AbstractDirectoryTestSuite.java:135)
> >>
> >>     at
> >> org.apache.maven.surefire.suite.AbstractDirectoryTestSuite.execute
> >> (AbstractDirectoryTestSuite.java:122)
> >>
> >>     at org.apache.maven.surefire.Surefire.run(Surefire.java:129)
> >>     at sun.reflect.NativeMethodAccessorImpl.invoke0(Native Method)
> >>     at
> >> sun.reflect.NativeMethodAccessorImpl.invoke
> >> (NativeMethodAccessorImpl.java:39)
> >>
> >>     at
> >> sun.reflect.DelegatingMethodAccessorImpl.invoke
> >> (DelegatingMethodAccessorImpl.java:25)
> >>
> >>     at java.lang.reflect.Method.invoke(Method.java:324)
> >>     at
> >> org.apache.maven.surefire.booter.SurefireBooter.runSuitesInProcess
> >> (SurefireBooter.java:225)
> >>
> >>     at
> >> org.apache.maven.surefire.booter.SurefireBooter.main
> >> (SurefireBooter.java:747)
> >>
> >> Tests run: 1, Failures: 0, Errors: 1, Skipped: 0, Time elapsed: 1.863
> >> sec <<< FAILURE!
> >> Running org.apache.geronimo.security.jaas.LoginPropertiesFileTest
> >> Tests run: 5, Failures: 0, Errors: 5, Skipped: 0, Time elapsed: 0.09
> >> sec <<< FAILURE!
> >> Running
> >> org.apache.geronimo.security.jaas.LoginKerberosNonGeronimoTest
> >> Tests run: 1, Failures: 0, Errors: 1, Skipped: 0, Time elapsed: 0.011
> >> sec <<< FAILURE!
> >> Running org.apache.geronimo.security.ContextManagerTest
> >> Tests run: 2, Failures: 0, Errors: 0, Skipped: 0, Time elapsed:
> >> 0.564 sec
> >> Running org.apache.geronimo.security.jaas.ConfigurationEntryTest
> >> Tests run: 1, Failures: 0, Errors: 1, Skipped: 0, Time elapsed: 0.013
> >> sec <<< FAILURE!
> >> Running org.apache.geronimo.security.jaas.TimeoutTest
> >> Tests run: 2, Failures: 0, Errors: 2, Skipped: 0, Time elapsed: 0.016
> >> sec <<< FAILURE!
> >> Running org.apache.geronimo.security.jaas.NoLoginModuleReuseTest
> >> Tests run: 1, Failures: 0, Errors: 0, Skipped: 0, Time elapsed:
> >> 0.013 sec
> >> Running org.apache.geronimo.security.jaas.LoginSQLTest
> >> Tests run: 3, Failures: 0, Errors: 3, Skipped: 0, Time elapsed: 0.017
> >> sec <<< FAILURE!
> >> Running org.apache.geronimo.security.remoting.jmx.RemoteLoginTest
> >> Tests run: 1, Failures: 0, Errors: 1, Skipped: 0, Time elapsed: 0.01
> >> sec <<< FAILURE!
> >> Running org.apache.geronimo.security.jaas.MultipleLoginDomainTest
> >> Tests run: 2, Failures: 0, Errors: 0, Skipped: 0, Time elapsed:
> >> 0.014 sec
> >> Running
> >> org.apache.geronimo.security.jacc.GeronimoPolicyConfigurationFactoryT
> >> est
> >> Tests run: 2, Failures: 0, Errors: 0, Skipped: 0, Time elapsed:
> >> 0.009 sec
> >> Running org.apache.geronimo.security.jaas.LoginKerberosTest
> >> Tests run: 1, Failures: 0, Errors: 1, Skipped: 0, Time elapsed: 0.01
> >> sec <<< FAILURE!
> >>
> >> Results :
> >> Tests run: 22, Failures: 0, Errors: 15, Skipped: 0
> >>
> >> [INFO]
> >> ---------------------------------------------------------------------
> >> ---
> >> [ERROR] BUILD FAILURE
> >> [INFO]
> >> ---------------------------------------------------------------------
> >> ---
> >> [INFO] There are test failures.
> >> [INFO]
> >> ---------------------------------------------------------------------
> >> ---
> >> [INFO] Trace
> >> org.apache.maven.BuildFailureException: There are test failures.
> >>     at
> >> org.apache.maven.lifecycle.DefaultLifecycleExecutor.executeGoals
> >> (DefaultLifecycleExecutor.java:555)
> >>
> >>     at
> >> org.apache.maven.lifecycle.DefaultLifecycleExecutor.executeGoalWithLi
> >> fecycle(DefaultLifecycleExecutor.java:475)
> >>
> >>     at
> >> org.apache.maven.lifecycle.DefaultLifecycleExecutor.executeGoal
> >> (DefaultLifecycleExecutor.java:454)
> >>
> >>     at
> >> org.apache.maven.lifecycle.DefaultLifecycleExecutor.executeGoalAndHan
> >> dleFailures(DefaultLifecycleExecutor.java:306)
> >>
> >>     at
> >> org.apache.maven.lifecycle.DefaultLifecycleExecutor.executeTaskSegmen
> >> ts(DefaultLifecycleExecutor.java:273)
> >>
> >>     at
> >> org.apache.maven.lifecycle.DefaultLifecycleExecutor.execute
> >> (DefaultLifecycleExecutor.java:140)
> >>
> >>     at org.apache.maven.DefaultMaven.doExecute(DefaultMaven.java:322)
> >>     at org.apache.maven.DefaultMaven.execute(DefaultMaven.java:115)
> >>     at org.apache.maven.cli.MavenCli.main(MavenCli.java:256)
> >>     at sun.reflect.NativeMethodAccessorImpl.invoke0(Native Method)
> >>     at
> >> sun.reflect.NativeMethodAccessorImpl.invoke
> >> (NativeMethodAccessorImpl.java:39)
> >>
> >>     at
> >> sun.reflect.DelegatingMethodAccessorImpl.invoke
> >> (DelegatingMethodAccessorImpl.java:25)
> >>
> >>     at java.lang.reflect.Method.invoke(Method.java:324)
> >>     at
> >> org.codehaus.classworlds.Launcher.launchEnhanced(Launcher.java:315)
> >>     at org.codehaus.classworlds.Launcher.launch(Launcher.java:255)
> >>     at
> >> org.codehaus.classworlds.Launcher.mainWithExitCode(Launcher.java:430)
> >>     at org.codehaus.classworlds.Launcher.main(Launcher.java:375)
> >> Caused by: org.apache.maven.plugin.MojoFailureException: There are
> >> test failures.
> >>     at
> >> org.apache.maven.plugin.surefire.SurefirePlugin.execute
> >> (SurefirePlugin.java:403)
> >>
> >>     at
> >> org.apache.maven.plugin.DefaultPluginManager.executeMojo
> >> (DefaultPluginManager.java:412)
> >>
> >>     at
> >> org.apache.maven.lifecycle.DefaultLifecycleExecutor.executeGoals
> >> (DefaultLifecycleExecutor.java:534)
> >>
> >>     ... 16 more
> >> [INFO]
> >> ---------------------------------------------------------------------
> >> ---
> >> [INFO] Total time: 3 minutes 46 seconds
> >> [INFO] Finished at: Mon Sep 25 23:38:54 LKT 2006
> >> [INFO] Final Memory: 41M/63M
> >> [INFO]
> >> ---------------------------------------------------------------------
> >> ---
> >>
> >> can any please help me to fix this error and get a successful build?
> >>
> >> Thanks
> >> Kanchana
> > Kanchana (and everyone else too),
> >
> > I just updated the wiki to help new Geronimo builders get past the
> > stumbling blocks that showed up when the specs were updated.  If
> > you use
> > bootstrap, you will need to use it in 'handholding' mode - In other
> > words, you can no longer just run bootstrap and get a successful
> > build.
> > Building specs requires Java 1.5 and the rest of Geronimo should be
> > built with Java 1.4.
> >
> > Please take a look at the updated page to see if my changes make the
> > build more straight forward or if they confuse things.
> >
> > Jay
>
>

Mime
View raw message