geronimo-dev mailing list archives

Site index · List index
Message view « Date » · « Thread »
Top « Date » · « Thread »
From "Jacek Laskowski" <ja...@laskowski.net.pl>
Subject Test failure in javamail 1.3.1 spec
Date Mon, 28 Aug 2006 10:36:48 GMT
Hi,

Does anyone know how to get rid of it:

jlaskowski@dev /cygdrive/c/oss/geronimo-specs/trunk
$ less geronimo-javamail_1.3.1_spec/target/surefire-reports/javax.mail.internet.MimeUtilityTest.txt
-------------------------------------------------------------------------------
Test set: javax.mail.internet.MimeUtilityTest
-------------------------------------------------------------------------------
Tests run: 4, Failures: 2, Errors: 0, Skipped: 0, Time elapsed: 0.344
sec <<< FAILURE!
testEncodeWord(javax.mail.internet.MimeUtilityTest)  Time elapsed: 0
sec  <<< FAILURE!
junit.framework.ComparisonFailure: expected:<...??...> but was:<...??...>
        at junit.framework.Assert.assertEquals(Assert.java:81)
        at junit.framework.Assert.assertEquals(Assert.java:87)
        at javax.mail.internet.MimeUtilityTest.testEncodeWord(MimeUtilityTest.java:94)

testEncodeText(javax.mail.internet.MimeUtilityTest)  Time elapsed: 0
sec  <<< FAILURE!
junit.framework.ComparisonFailure: expected:<...??...> but was:<...??...>
        at junit.framework.Assert.assertEquals(Assert.java:81)
        at junit.framework.Assert.assertEquals(Assert.java:87)
        at javax.mail.internet.MimeUtilityTest.testEncodeText(MimeUtilityTest.java:111)

It blows up the build. I'd prefer not to disable the tests, but find a
final solution or eventually disable the tests once they're described
appropriately.

Jacek

-- 
Jacek Laskowski
http://www.laskowski.net.pl

Mime
View raw message