geronimo-dev mailing list archives

Site index · List index
Message view « Date » · « Thread »
Top « Date » · « Thread »
From "Aaron Mulder (JIRA)" <...@geronimo.apache.org>
Subject [jira] Resolved: (GERONIMO-1993) Build failure during assembly of j2ee-installer
Date Thu, 08 Jun 2006 04:10:30 GMT
     [ http://issues.apache.org/jira/browse/GERONIMO-1993?page=all ]
     
Aaron Mulder resolved GERONIMO-1993:
------------------------------------

    Resolution: Cannot Reproduce

> Build failure during assembly of j2ee-installer
> -----------------------------------------------
>
>          Key: GERONIMO-1993
>          URL: http://issues.apache.org/jira/browse/GERONIMO-1993
>      Project: Geronimo
>         Type: Bug
>     Security: public(Regular issues) 
>   Components: installer
>     Versions: 1.1
>  Environment: Win XP
>     Reporter: Anita Kulshreshtha
>     Assignee: Anita Kulshreshtha
>     Priority: Minor
>      Fix For: 1.1
>  Attachments: j2ee-installer.patch
>
>     The build is failing during the assembly of j2ee-installer. The installer still allows
the jsp-examples-* and servlet-examples-* cars to be 
> installed in the server repository. The other servers i.e. j2ee-*-server do not install
these configurations anymore. We should remove these from the installer as well. This may
not be an issue on linux machines.
> ..........................................................................................
>    [java] Adding resource: ImgPacksPanel.img.17
>     [java] Adding resource: ImgPacksPanel.img.18
>     [java] Adding resource: ImgPacksPanel.img.19
>     [java] Adding resource: ImgPacksPanel.img.20
>     [java] Adding content of jar: file:/C:/Documents%20and%20Settings/User/.maven/repository/geronim
> o/jars/standalone-compiler-custom-3.8.0.jar!/bin/panels/HelloPanel.jar
>     [java] Adding content of jar: file:/C:/Documents%20and%20Settings/User/.maven/repository/geronim
> o/jars/standalone-compiler-custom-3.8.0.jar!/bin/panels/LicencePanel.jar
>     [java] Adding content of jar: file:/C:/Documents%20and%20Settings/User/.maven/repository/geronim
> o/jars/standalone-compiler-custom-3.8.0.jar!/bin/panels/TargetPanel.jar
>     [java] Adding content of jar: file:/C:/Documents%20and%20Settings/User/.maven/repository/geronim
> o/jars/standalone-compiler-custom-3.8.0.jar!/bin/panels/ImgPacksPanel.jar
>     [java] Adding content of jar: file:/C:/Documents%20and%20Settings/User/.maven/repository/geronim
> o/jars/standalone-compiler-custom-3.8.0.jar!/bin/panels/ValidatePackSelections.jar
>     [java] Adding content of jar: file:/C:/Documents%20and%20Settings/User/.maven/repository/geronim
> o/jars/standalone-compiler-custom-3.8.0.jar!/bin/panels/ValidatePackSelections.jar
>     [java] Adding content of jar: file:/C:/Documents%20and%20Settings/User/.maven/repository/geronim
> o/jars/standalone-compiler-custom-3.8.0.jar!/bin/panels/ValidatePackSelections.jar
>     [java] Adding content of jar: file:/C:/Documents%20and%20Settings/User/.maven/repository/geronim
> o/jars/standalone-compiler-custom-3.8.0.jar!/bin/panels/ValidatePackSelections.jar
>     [java] Adding content of jar: file:/C:/Documents%20and%20Settings/User/.maven/repository/geronim
> o/jars/standalone-compiler-custom-3.8.0.jar!/bin/panels/ValidatePackSelections.jar
>     [java] Adding content of jar: file:/C:/Documents%20and%20Settings/User/.maven/repository/geronim
> o/jars/standalone-compiler-custom-3.8.0.jar!/bin/panels/ValidatePackSelections.jar
>     [java] Adding content of jar: file:/C:/Documents%20and%20Settings/User/.maven/repository/geronim
> o/jars/standalone-compiler-custom-3.8.0.jar!/bin/panels/ValidatePackSelections.jar
>     [java] Adding content of jar: file:/C:/Documents%20and%20Settings/User/.maven/repository/geronim
> o/jars/standalone-compiler-custom-3.8.0.jar!/bin/panels/ValidatePackSelections.jar
>     [java] Adding content of jar: file:/C:/Documents%20and%20Settings/User/.maven/repository/geronim
> o/jars/standalone-compiler-custom-3.8.0.jar!/bin/panels/ValidatePackSelections.jar
>     [java] Adding content of jar: file:/C:/Documents%20and%20Settings/User/.maven/repository/geronim
> o/jars/standalone-compiler-custom-3.8.0.jar!/bin/panels/ValidatePackSelections.jar
>     [java] Adding content of jar: file:/C:/Documents%20and%20Settings/User/.maven/repository/geronim
> o/jars/standalone-compiler-custom-3.8.0.jar!/bin/panels/ValidatePackSelections.jar
>     [java] Adding content of jar: file:/C:/Documents%20and%20Settings/User/.maven/repository/geronim
> o/jars/standalone-compiler-custom-3.8.0.jar!/bin/panels/InstallPanel.jar
>     [java] Adding content of jar: file:/C:/Documents%20and%20Settings/User/.maven/repository/geronim
> o/jars/standalone-compiler-custom-3.8.0.jar!/bin/panels/ProcessPanel.jar
>     [java] Adding content of jar: file:/C:/Documents%20and%20Settings/User/.maven/repository/geronim
> o/jars/standalone-compiler-custom-3.8.0.jar!/bin/panels/InfoPanel.jar
>     [java] Adding content of jar: file:/C:/Documents%20and%20Settings/User/.maven/repository/geronim
> o/jars/standalone-compiler-custom-3.8.0.jar!/bin/panels/FinishPanel.jar
>     [java] -> Fatal error :
>     [java]    D:\XXXXX\geronimo\geronimo-1.1\assemblies\j2ee-installer/target/geronimo-1.1-SNAPSHOT/
> geronimo-izpack.xml:96: D:\XXXXX\geronimo\geronimo-1.1\assemblies\j2ee-installer\target\geronimo-1.1
> -SNAPSHOT\repository\geronimo\jsp-examples-tomcat\1.1-SNAPSHOT\jsp-examples-tomcat-1.1-SNAPSHOT.car\
> WEB-INF\classes\org\apache\jsp\jsp2\jspattribute\shuffle_jsp$shuffle_jspHelper.class
>     [java] com.izforge.izpack.compiler.CompilerException: D:\xxxxx\geronimo\geronimo-1.1\assemblies\
> j2ee-installer/target/geronimo-1.1-SNAPSHOT/geronimo-izpack.xml:96: D:\XXXXX\geronimo\geronimo-1.1\a
> ssemblies\j2ee-installer\target\geronimo-1.1-SNAPSHOT\repository\geronimo\jsp-examples-tomcat\1.1-SN
> APSHOT\jsp-examples-tomcat-1.1-SNAPSHOT.car\WEB-INF\classes\org\apache\jsp\jsp2\jspattribute\shuffle
> _jsp$shuffle_jspHelper.class
>     [java]      at com.izforge.izpack.compiler.CompilerConfig.parseError(CompilerConfig.java:1531)
>     [java]      at com.izforge.izpack.compiler.CompilerConfig.addPacks(CompilerConfig.java:636)
>     [java]      at com.izforge.izpack.compiler.CompilerConfig.executeCompiler(CompilerConfig.java:31
> 7)
>     [java]      at com.izforge.izpack.compiler.CompilerConfig.main(CompilerConfig.java:1847)
>     [java]      at com.izforge.izpack.compiler.Compiler.main(Compiler.java:620)
>     [java] Caused by: java.io.FileNotFoundException: D:\xxxxx\geronimo\geronimo-1.1\assemblies\j2ee-
> installer\target\geronimo-1.1-SNAPSHOT\repository\geronimo\jsp-examples-tomcat\1.1-SNAPSHOT\jsp-exam
> ples-tomcat-1.1-SNAPSHOT.car\WEB-INF\classes\org\apache\jsp\jsp2\jspattribute\shuffle_jsp$shuffle_js
> pHelper.class
>     [java]      at com.izforge.izpack.compiler.PackInfo.addFile(PackInfo.java:193)
>     [java]      at com.izforge.izpack.compiler.CompilerConfig.addRecursively(CompilerConfig.java:959
> )
>     [java]      at com.izforge.izpack.compiler.CompilerConfig.addRecursively(CompilerConfig.java:969
> )
>     [java]      at com.izforge.izpack.compiler.CompilerConfig.addRecursively(CompilerConfig.java:969
> )
>     [java]      at com.izforge.izpack.compiler.CompilerConfig.addRecursively(CompilerConfig.java:969
> )
>     [java]      at com.izforge.izpack.compiler.CompilerConfig.addRecursively(CompilerConfig.java:969
> )
>     [java]      at com.izforge.izpack.compiler.CompilerConfig.addRecursively(CompilerConfig.java:969
> )
>     [java]      at com.izforge.izpack.compiler.CompilerConfig.addRecursively(CompilerConfig.java:969
> )
>     [java]      at com.izforge.izpack.compiler.CompilerConfig.addRecursively(CompilerConfig.java:969
> )
>     [java]      at com.izforge.izpack.compiler.CompilerConfig.addRecursively(CompilerConfig.java:969
> )
>     [java]      at com.izforge.izpack.compiler.CompilerConfig.addRecursively(CompilerConfig.java:969
> )
>     [java]      at com.izforge.izpack.compiler.CompilerConfig.addRecursively(CompilerConfig.java:969
> )
>     [java]      at com.izforge.izpack.compiler.CompilerConfig.addRecursively(CompilerConfig.java:969
> )
>     [java]      at com.izforge.izpack.compiler.CompilerConfig.addRecursively(CompilerConfig.java:969
> )
>     [java]      at com.izforge.izpack.compiler.CompilerConfig.addPacks(CompilerConfig.java:632)
>     [java]      ... 3 more
>     [java]
>     [java] (tip : use -? to get the commmand line parameters)
>     [java] [ERROR] Java Result: 1
> BUILD FAILED
> File...... D:\xxxxx\geronimo\geronimo-1.1\maven.xml
> Element... maven:reactor
> Line...... 63
> Column.... 108
> Unable to obtain goal [multiproject:install-callback] -- C:\Documents and Settings\User\.maven\cache
> \geronimo-izpack-plugin-1.1-SNAPSHOT\plugin.jelly:78:149: <ant:copy> Warning: Could
not find file D:
> \xxxxx\geronimo\geronimo-1.1\assemblies\j2ee-installer\target\geronimo-installer-1.1-SNAPSHOT.jar
to
>  copy.
> Total time: 17 minutes 19 seconds
> Finished at: Fri May 05 09:15:53 EDT 2006

-- 
This message is automatically generated by JIRA.
-
If you think it was sent incorrectly contact one of the administrators:
   http://issues.apache.org/jira/secure/Administrators.jspa
-
For more information on JIRA, see:
   http://www.atlassian.com/software/jira


Mime
View raw message