geronimo-dev mailing list archives

Site index · List index
Message view « Date » · « Thread »
Top « Date » · « Thread »
From "Donald Woods (JIRA)" <j...@apache.org>
Subject [jira] Commented: (GERONIMODEVTOOLS-81) Not able to build server from trunk ,
Date Sun, 21 May 2006 16:45:30 GMT
    [ http://issues.apache.org/jira/browse/GERONIMODEVTOOLS-81?page=comments#action_12412680
] 

Donald Woods commented on GERONIMODEVTOOLS-81:
----------------------------------------------

All references to repository cvs.apache.org need to be updated to people.apche.org for the
1.0.0 tag and Trunk.

> Not able to build server from trunk ,
> -------------------------------------
>
>          Key: GERONIMODEVTOOLS-81
>          URL: http://issues.apache.org/jira/browse/GERONIMODEVTOOLS-81
>      Project: Geronimo-Devtools
>         Type: Bug

>     Versions: 1.0.0
>  Environment: Win2k , java1.4_08, maven1.02, svn 1.3 client 
>     Reporter: Mansoor

>
> 1. Checked out the lastest code from trunk using below command :
>              svn co http://svn.apache.org/repos/asf/geronimo/trunk geronimo 
> 2.Tried building the server ..
> Results  : I cann't build the server due to lot of dependencies not getting downloaded.

> ERRORS :
> -------------------------------
> Error retrieving artifact from [http://cvs.apache.org/repository/commons-jelly/j
> ars/commons-jelly-20030902.160215.jar]: java.io.IOException: Unknown error downl
> oading; status code was: 302
> 150K downloaded
> Attempting to download commons-jelly-tags-jsl-20030211.143151.jar.
> Error retrieving artifact from [http://cvs.apache.org/repository/commons-jelly/j
> ars/commons-jelly-tags-jsl-20030211.143151.jar]: java.io.IOException: Unknown er
> ror downloading; status code was: 302
> 14K downloaded
> Attempting to download commons-jelly-tags-log-20030211.142821.jar.
> Error retrieving artifact from [http://cvs.apache.org/repository/commons-jelly/j
> ars/commons-jelly-tags-log-20030211.142821.jar]: java.io.IOException: Unknown er
> ror downloading; status code was: 302
> 8K downloaded
> Attempting to download commons-jelly-tags-velocity-20030303.205659.jar.
> Error retrieving artifact from [http://cvs.apache.org/repository/commons-jelly/j
> ars/commons-jelly-tags-velocity-20030303.205659.jar]: java.io.IOException: Unkno
> wn error downloading; status code was: 302
> 7K downloaded
> Attempting to download commons-jelly-tags-xml-20040613.030723.jar.
> Error retrieving artifact from [http://cvs.apache.org/repository/commons-jelly/j
> ars/commons-jelly-tags-xml-20040613.030723.jar]: java.io.IOException: Unknown er
> ror downloading; status code was: 302
> 33K downloaded
> Attempting to download commons-logging-1.0.3.jar.
> Error retrieving artifact from [http://cvs.apache.org/repository/commons-logging
> /jars/commons-logging-1.0.3.jar]: java.io.IOException: Unknown error downloading
> ; status code was: 302
> 30K downloaded
> Attempting to download velocity-1.4-dev.jar.
> Error retrieving artifact from [http://cvs.apache.org/repository/velocity/jars/v
> elocity-1.4-dev.jar]: java.io.IOException: Unknown error downloading; status cod
> e was: 302
> 505K downloaded
> Attempting to download velocity-dvsl-0.45.jar.
> Error retrieving artifact from [http://cvs.apache.org/repository/velocity-dvsl/j
> ars/velocity-dvsl-0.45.jar]: java.io.IOException: Unknown error downloading; sta
> tus code was: 302
> 25K downloaded
> Attempting to download xml-apis-1.0.b2.jar.
> Error retrieving artifact from [http://cvs.apache.org/repository/xml-apis/jars/x
> ml-apis-1.0.b2.jar]: java.io.IOException: Unknown error downloading; status code
>  was: 302
> 106K downloaded
> Attempting to download isorelax-20030108.jar.
> Error retrieving artifact from [http://cvs.apache.org/repository/isorelax/jars/i
> sorelax-20030108.jar]: java.io.IOException: Unknown error downloading; status co
> de was: 302
> 188K downloaded
> Attempting to download jing-20030619.jar.
> Error retrieving artifact from [http://cvs.apache.org/repository/thaiopensource/
> jars/jing-20030619.jar]: java.io.IOException: Unknown error downloading; status
> code was: 302
> 475K downloaded
> Attempting to download xerces-2.4.0.jar.
> Error retrieving artifact from [http://cvs.apache.org/repository/xerces/jars/xer
> ces-2.4.0.jar]: java.io.IOException: Unknown error downloading; status code was:
>  302
> 874K downloaded
> Attempting to download commons-io-20030203.000550.jar.
> Error retrieving artifact from [http://cvs.apache.org/repository/commons-io/jars
> /commons-io-20030203.000550.jar]: java.io.IOException: Unknown error downloading
> ; status code was: 302
> 59K downloaded
> Attempting to download commons-net-1.1.0.jar.
> Error retrieving artifact from [http://cvs.apache.org/repository/commons-net/jar
> s/commons-net-1.1.0.jar]: java.io.IOException: Unknown error downloading; status
>  code was: 302
> 139K downloaded
> Attempting to download commons-httpclient-2.0.jar.
> Error retrieving artifact from [http://cvs.apache.org/repository/commons-httpcli
> ent/jars/commons-httpclient-2.0.jar]: java.io.IOException: Unknown error downloa
> ding; status code was: 302
> 217K downloaded
> Attempting to download commons-lang-2.0.jar.
> Error retrieving artifact from [http://cvs.apache.org/repository/commons-lang/ja
> rs/commons-lang-2.0.jar]: java.io.IOException: Unknown error downloading; status
>  code was: 302
> 165K downloaded
> Attempting to download jsch-0.1.5.jar.
> Error retrieving artifact from [http://cvs.apache.org/repository/jsch/jars/jsch-
> 0.1.5.jar]: java.io.IOException: Unknown error downloading; status code was: 302
> 79K downloaded
> build:start:
> new:
> new0:
> m:tranql:
> new00:
> m:tranql2:
> new1:
> m:geronimo:core:
> build:start:
> multiproject:install-callback:
>     [echo] Running jar:install for Geronimo :: Activation
> Attempting to download junit-3.8.1.jar.
> Error retrieving artifact from [http://cvs.apache.org/repository/junit/jars/juni
> t-3.8.1.jar]: java.io.IOException: Unknown error downloading; status code was: 3
> 02
> 118K downloaded
> Attempting to download commons-jelly-tags-antlr-20030211.143720.jar.
> Error retrieving artifact from [http://cvs.apache.org/repository/commons-jelly/j
> ars/commons-jelly-tags-antlr-20030211.143720.jar]: java.io.IOException: Unknown
> error downloading; status code was: 302
> 7K downloaded
> Attempting to download antlr-2.7.2.jar.
> Error retrieving artifact from [http://cvs.apache.org/repository/antlr/jars/antl
> r-2.7.2.jar]: java.io.IOException: Unknown error downloading; status code was: 3
> 02
> 349K downloaded
> java:prepare-filesystem:
>     [mkdir] Created dir: C:\geronimo_src\geronimo\modules\activation\target\clas
> ses
> java:compile:
>     [depend] Deleted 0 out of date files in 0 seconds
>     [echo] Compiling to C:\geronimo_src\geronimo\modules\activation/target/class
> es
>     [javac] Compiling 8 source files to C:\geronimo_src\geronimo\modules\activat
> ion\target\classes
> java:jar-resources:
> Copying 1 file to C:\geronimo_src\geronimo\modules\activation\target\classes
> test:prepare-filesystem:
>     [mkdir] Created dir: C:\geronimo_src\geronimo\modules\activation\target\test
> -classes
>     [mkdir] Created dir: C:\geronimo_src\geronimo\modules\activation\target\test
> -reports
> test:test-resources:
> test:compile:
> test:test:
>     [touch] Creating C:\geronimo_src\geronimo\modules\activation\target\test-rep
> orts\tstamp
> jar:jar:
>     [jar] Building jar: C:\geronimo_src\geronimo\modules\activation\target\geron
> imo-activation-1.2-SNAPSHOT.jar
> Copying: from 'C:\geronimo_src\geronimo\modules\activation\target\geronimo-activ
> ation-1.2-SNAPSHOT.jar' to: 'C:\Documents and Settings\administrator.LILA\.maven
> \repository\geronimo\jars\geronimo-activation-1.2-SNAPSHOT.jar'
> Copying: from 'C:\geronimo_src\geronimo\modules\activation\project.xml' to: 'C:\
> Documents and Settings\administrator.LILA\.maven\repository\geronimo\poms\geroni
> mo-activation-1.2-SNAPSHOT.pom'
> +----------------------------------------
> | geronimo-modules and geronimo-plugins Geronimo :: ActiveMQ Embedded RAR
> | Memory: 9M/16M
> +----------------------------------------
> Attempting to download activemq-core-4.0-SNAPSHOT.jar.
> Error retrieving artifact from [http://cvs.apache.org/repository/incubator-activ
> emq/jars/activemq-core-4.0-SNAPSHOT.jar]: java.io.IOException: Unknown error dow
> nloading; status code was: 302
> WARNING: Failed to download activemq-core-4.0-SNAPSHOT.jar.
> Attempting to download activemq-ra-4.0-SNAPSHOT.jar.
> Error retrieving artifact from [http://cvs.apache.org/repository/incubator-activ
> emq/jars/activemq-ra-4.0-SNAPSHOT.jar]: java.io.IOException: Unknown error downl
> oading; status code was: 302
> WARNING: Failed to download activemq-ra-4.0-SNAPSHOT.jar.
> BUILD FAILED
> File...... C:\geronimo_src\geronimo\maven.xml
> Element... maven:reactor
> Line...... 207
> Column.... 166
> The build cannot continue because of the following unsatisfied dependencies:
> activemq-core-4.0-SNAPSHOT.jar
> activemq-ra-4.0-SNAPSHOT.jar
> Total time: 4 minutes 2 seconds
> Finished at: Sun May 21 12:00:21 IST 2006

-- 
This message is automatically generated by JIRA.
-
If you think it was sent incorrectly contact one of the administrators:
   http://issues.apache.org/jira/secure/Administrators.jspa
-
For more information on JIRA, see:
   http://www.atlassian.com/software/jira


Mime
View raw message