geronimo-dev mailing list archives

Site index · List index
Message view « Date » · « Thread »
Top « Date » · « Thread »
From "Anders Hessellund Jensen (JIRA)" <...@geronimo.apache.org>
Subject [jira] Created: (GERONIMO-1627) LoginKerberosNonGeronimoTest fails
Date Wed, 15 Feb 2006 11:00:09 GMT
LoginKerberosNonGeronimoTest fails
----------------------------------

         Key: GERONIMO-1627
         URL: http://issues.apache.org/jira/browse/GERONIMO-1627
     Project: Geronimo
        Type: Bug
  Components: security  
    Reporter: Anders Hessellund Jensen


Output when running the junit test suite:

test:test:
    [junit] Running org.apache.geronimo.security.ContextManagerTest
    [junit] Tests run: 1, Failures: 0, Errors: 0, Time elapsed: 0,5 sec
    [junit] Running org.apache.geronimo.security.jaas.ConfigurationEntryTest
    [junit] Tests run: 1, Failures: 0, Errors: 0, Time elapsed: 1,093 sec
    [junit] Running org.apache.geronimo.security.jaas.LoginKerberosNonGeronimoTest
    [junit] Error calling function Protocol status: 1312
    [junit] FormatMessage failed with 1815
    [junit] [ERROR] Test org.apache.geronimo.security.jaas.LoginKerberosNonGeronimoTest FAILED
    [junit] Running org.apache.geronimo.security.jaas.LoginKerberosTest
    [junit] Tests run: 1, Failures: 0, Errors: 0, Time elapsed: 0,75 sec
    [junit] Running org.apache.geronimo.security.jaas.LoginPropertiesFileTest
    [junit] Tests run: 5, Failures: 0, Errors: 0, Time elapsed: 1,453 sec
    [junit] Running org.apache.geronimo.security.jaas.LoginSQLTest
    [junit] Tests run: 3, Failures: 0, Errors: 0, Time elapsed: 1,687 sec
    [junit] Running org.apache.geronimo.security.jaas.MultipleLoginDomainTest
    [junit] Tests run: 2, Failures: 0, Errors: 0, Time elapsed: 0,234 sec
    [junit] Running org.apache.geronimo.security.jaas.NoLoginModuleReuseTest
    [junit] Tests run: 1, Failures: 0, Errors: 0, Time elapsed: 0,234 sec
    [junit] Running org.apache.geronimo.security.jaas.TimeoutTest
    [junit] Tests run: 2, Failures: 0, Errors: 0, Time elapsed: 11,625 sec
    [junit] Running org.apache.geronimo.security.jacc.GeronimoPolicyConfigurationFactoryTest
    [junit] Tests run: 2, Failures: 0, Errors: 0, Time elapsed: 0,219 sec
    [junit] Running org.apache.geronimo.security.network.protocol.SubjectCarryingProtocolTest
    [junit] Tests run: 1, Failures: 0, Errors: 0, Time elapsed: 1,234 sec
    [junit] Running org.apache.geronimo.security.remoting.jmx.RemoteLoginTest
    [junit] Tests run: 1, Failures: 0, Errors: 0, Time elapsed: 1,187 sec

BUILD FAILED
File...... C:\Documents and Settings\ahj\.maven\cache\maven-test-plugin-1.7\plugin.jelly
Element... fail
Line...... 183
Column.... -1
There were test failures.
Total time   : 35 seconds 


-- 
This message is automatically generated by JIRA.
-
If you think it was sent incorrectly contact one of the administrators:
   http://issues.apache.org/jira/secure/Administrators.jspa
-
For more information on JIRA, see:
   http://www.atlassian.com/software/jira


Mime
View raw message