geronimo-dev mailing list archives

Site index · List index
Message view « Date » · « Thread »
Top « Date » · « Thread »
From Jeff Genender <jgenen...@apache.org>
Subject Re: Stack trace in TomcatModuleBuilder
Date Wed, 11 Jan 2006 19:23:33 GMT
Hi Anita,

Thank you for pointing this out.  Yes..it had a bug...and I fixed it
thanks to you:

Sending
tomcat-builder/src/test/org/apache/geronimo/tomcat/deployment/TomcatModuleBuilderTest.java
Adding
tomcat-builder/src/test-resources/deployables/war5/META-INF/soap_encoding_1_1.xsd
Adding
tomcat-builder/src/test-resources/deployables/war5/WEB-INF/geronimo-web.xml
Transmitting file data ...
Committed revision 368104.

Update and retry.

Thanks,

Jeff

anita kulshreshtha wrote:
> Jeff, 
>     I am seeing this with rev 368017. I am still
> investigating. Are you seeing the same. The test does
> not fail but produces a stack trace. 
> 
> thanks
> Anita
> 
> __________________________________________________
> Do You Yahoo!?
> Tired of spam?  Yahoo! Mail has the best spam protection around 
> http://mail.yahoo.com 
> 
> 
> ------------------------------------------------------------------------
> 
> Testsuite: org.apache.geronimo.tomcat.deployment.TomcatModuleBuilderTest
> Tests run: 2, Failures: 0, Errors: 0, Time elapsed: 12.188 sec
> 
> ------------- Standard Output ---------------
> Created MBeanServer with ID: 1202d69:108ba22139a:-8000:a-680de82293e44:1
> Object names: [test:J2EEApplication=null,J2EEModule=org/apache/geronimo/test,J2EEServer=bar,j2eeType=GBean,name=TomcatRealm,
test:J2EEApplication=null,J2EEModule=org/apache/geronimo/test,J2EEServer=bar,j2eeType=TomcatValve,name=SecondValve,
test:J2EEApplication=null,J2EEServer=bar,j2eeType=WebModule,name=org/apache/geronimo/test,
test:J2EEApplication=null,J2EEModule=org/apache/geronimo/test,J2EEServer=bar,j2eeType=TomcatValve,name=FirstValve]
> STATE: 1 - test:J2EEApplication=null,J2EEModule=org/apache/geronimo/test,J2EEServer=bar,j2eeType=GBean,name=TomcatRealm
> STATE: 1 - test:J2EEApplication=null,J2EEModule=org/apache/geronimo/test,J2EEServer=bar,j2eeType=TomcatValve,name=SecondValve
> STATE: 1 - test:J2EEApplication=null,J2EEServer=bar,j2eeType=WebModule,name=org/apache/geronimo/test
> STATE: 1 - test:J2EEApplication=null,J2EEModule=org/apache/geronimo/test,J2EEServer=bar,j2eeType=TomcatValve,name=FirstValve
> Retrieving document at 'WEB-INF/wsdl/hello.wsdl'.
> Object names: [test:J2EEApplication=null,J2EEServer=bar,j2eeType=WebModule,name=hello]
> STATE: 1 - test:J2EEApplication=null,J2EEServer=bar,j2eeType=WebModule,name=hello
> ------------- ---------------- ---------------
> ------------- Standard Error -----------------
> Jan 11, 2006 10:42:46 AM org.apache.catalina.core.StandardContext resourcesStart
> SEVERE: Error starting static Resources
> java.lang.IllegalArgumentException: Document base D:\anita\geronimo\geronimo-1.0\modules\tomcat-builder\src\test-resources\deployables\war4\war
does not exist or is not a readable directory
> 	at org.apache.naming.resources.FileDirContext.setDocBase(FileDirContext.java:140)
> 	at org.apache.catalina.core.StandardContext.resourcesStart(StandardContext.java:3754)
> 	at org.apache.catalina.core.StandardContext.start(StandardContext.java:3925)
> 	at org.apache.geronimo.tomcat.GeronimoStandardContext.access$101(GeronimoStandardContext.java:64)
> 	at org.apache.geronimo.tomcat.GeronimoStandardContext$SystemMethodValve.invoke(GeronimoStandardContext.java:257)
> 	at org.apache.geronimo.tomcat.valve.PolicyContextValve.invoke(PolicyContextValve.java:50)
> 	at org.apache.geronimo.tomcat.valve.TransactionContextValve.invoke(TransactionContextValve.java:53)
> 	at org.apache.geronimo.tomcat.valve.ComponentContextValve.invoke(ComponentContextValve.java:47)
> 	at org.apache.geronimo.tomcat.valve.InstanceContextValve.invoke(InstanceContextValve.java:60)
> 	at org.apache.geronimo.tomcat.GeronimoStandardContext.start(GeronimoStandardContext.java:173)
> 	at org.apache.catalina.core.ContainerBase.addChildInternal(ContainerBase.java:759)
> 	at org.apache.catalina.core.ContainerBase.addChild(ContainerBase.java:739)
> 	at org.apache.catalina.core.StandardHost.addChild(StandardHost.java:524)
> 	at org.apache.geronimo.tomcat.TomcatContainer.addContext(TomcatContainer.java:287)
> 	at org.apache.geronimo.tomcat.TomcatContainer$$FastClassByCGLIB$$9370b073.invoke(<generated>)
> 	at net.sf.cglib.reflect.FastMethod.invoke(FastMethod.java:53)
> 	at org.apache.geronimo.gbean.runtime.FastMethodInvoker.invoke(FastMethodInvoker.java:38)
> 	at org.apache.geronimo.gbean.runtime.GBeanOperation.invoke(GBeanOperation.java:118)
> 	at org.apache.geronimo.gbean.runtime.GBeanInstance.invoke(GBeanInstance.java:800)
> 	at org.apache.geronimo.gbean.runtime.RawInvoker.invoke(RawInvoker.java:57)
> 	at org.apache.geronimo.kernel.basic.RawOperationInvoker.invoke(RawOperationInvoker.java:36)
> 	at org.apache.geronimo.kernel.basic.ProxyMethodInterceptor.intercept(ProxyMethodInterceptor.java:96)
> 	at org.apache.geronimo.tomcat.TomcatContainer$$EnhancerByCGLIB$$9a1cf8ff.addContext(<generated>)
> 	at org.apache.geronimo.tomcat.TomcatWebAppContext.doStart(TomcatWebAppContext.java:462)
> 	at org.apache.geronimo.gbean.runtime.GBeanInstance.createInstance(GBeanInstance.java:936)
> 	at org.apache.geronimo.gbean.runtime.GBeanInstanceState.attemptFullStart(GBeanInstanceState.java:325)
> 	at org.apache.geronimo.gbean.runtime.GBeanInstanceState.start(GBeanInstanceState.java:110)
> 	at org.apache.geronimo.gbean.runtime.GBeanInstanceState.startRecursive(GBeanInstanceState.java:132)
> 	at org.apache.geronimo.gbean.runtime.GBeanInstance.startRecursive(GBeanInstance.java:537)
> 	at org.apache.geronimo.kernel.basic.BasicKernel.startRecursiveGBean(BasicKernel.java:208)
> 	at org.apache.geronimo.kernel.config.Configuration.startRecursiveGBeans(Configuration.java:315)
> 	at org.apache.geronimo.kernel.config.Configuration$$FastClassByCGLIB$$7f4b4a9b.invoke(<generated>)
> 	at net.sf.cglib.reflect.FastMethod.invoke(FastMethod.java:53)
> 	at org.apache.geronimo.gbean.runtime.FastMethodInvoker.invoke(FastMethodInvoker.java:38)
> 	at org.apache.geronimo.gbean.runtime.GBeanOperation.invoke(GBeanOperation.java:118)
> 	at org.apache.geronimo.gbean.runtime.GBeanInstance.invoke(GBeanInstance.java:835)
> 	at org.apache.geronimo.kernel.basic.BasicKernel.invoke(BasicKernel.java:178)
> 	at org.apache.geronimo.kernel.basic.BasicKernel.invoke(BasicKernel.java:173)
> 	at org.apache.geronimo.tomcat.deployment.TomcatModuleBuilderTest.deployWar(TomcatModuleBuilderTest.java:194)
> 	at org.apache.geronimo.tomcat.deployment.TomcatModuleBuilderTest.testDeployWar4(TomcatModuleBuilderTest.java:147)
> 	at sun.reflect.NativeMethodAccessorImpl.invoke0(Native Method)
> 	at sun.reflect.NativeMethodAccessorImpl.invoke(NativeMethodAccessorImpl.java:39)
> 	at sun.reflect.DelegatingMethodAccessorImpl.invoke(DelegatingMethodAccessorImpl.java:25)
> 	at java.lang.reflect.Method.invoke(Method.java:324)
> 	at junit.framework.TestCase.runTest(TestCase.java:154)
> 	at junit.framework.TestCase.runBare(TestCase.java:127)
> 	at junit.framework.TestResult$1.protect(TestResult.java:106)
> 	at junit.framework.TestResult.runProtected(TestResult.java:124)
> 	at junit.framework.TestResult.run(TestResult.java:109)
> 	at junit.framework.TestCase.run(TestCase.java:118)
> 	at junit.framework.TestSuite.runTest(TestSuite.java:208)
> 	at junit.framework.TestSuite.run(TestSuite.java:203)
> 	at org.apache.tools.ant.taskdefs.optional.junit.JUnitTestRunner.run(JUnitTestRunner.java:325)
> 	at org.apache.tools.ant.taskdefs.optional.junit.JUnitTestRunner.main(JUnitTestRunner.java:536)
> Jan 11, 2006 10:42:46 AM org.apache.catalina.core.StandardContext start
> SEVERE: Error in resourceStart()
> Jan 11, 2006 10:42:46 AM org.apache.catalina.core.StandardContext start
> SEVERE: Error getConfigured
> Jan 11, 2006 10:42:46 AM org.apache.catalina.core.StandardContext start
> SEVERE: Context [/test] startup failed due to previous errors
> Jan 11, 2006 10:42:47 AM org.apache.catalina.core.StandardContext resourcesStart
> SEVERE: Error starting static Resources
> java.lang.IllegalArgumentException: Document base D:\anita\geronimo\geronimo-1.0\modules\tomcat-builder\src\test-resources\deployables\war4\war
does not exist or is not a readable directory
> 	at org.apache.naming.resources.FileDirContext.setDocBase(FileDirContext.java:140)
> 	at org.apache.catalina.core.StandardContext.resourcesStart(StandardContext.java:3754)
> 	at org.apache.catalina.core.StandardContext.start(StandardContext.java:3925)
> 	at org.apache.geronimo.tomcat.GeronimoStandardContext.access$101(GeronimoStandardContext.java:64)
> 	at org.apache.geronimo.tomcat.GeronimoStandardContext$SystemMethodValve.invoke(GeronimoStandardContext.java:257)
> 	at org.apache.geronimo.tomcat.valve.PolicyContextValve.invoke(PolicyContextValve.java:50)
> 	at org.apache.geronimo.tomcat.valve.TransactionContextValve.invoke(TransactionContextValve.java:53)
> 	at org.apache.geronimo.tomcat.valve.ComponentContextValve.invoke(ComponentContextValve.java:47)
> 	at org.apache.geronimo.tomcat.valve.InstanceContextValve.invoke(InstanceContextValve.java:60)
> 	at org.apache.geronimo.tomcat.GeronimoStandardContext.start(GeronimoStandardContext.java:173)
> 	at org.apache.catalina.core.ContainerBase.addChildInternal(ContainerBase.java:759)
> 	at org.apache.catalina.core.ContainerBase.addChild(ContainerBase.java:739)
> 	at org.apache.catalina.core.StandardHost.addChild(StandardHost.java:524)
> 	at org.apache.geronimo.tomcat.TomcatContainer.addContext(TomcatContainer.java:287)
> 	at org.apache.geronimo.tomcat.TomcatContainer$$FastClassByCGLIB$$9370b073.invoke(<generated>)
> 	at net.sf.cglib.reflect.FastMethod.invoke(FastMethod.java:53)
> 	at org.apache.geronimo.gbean.runtime.FastMethodInvoker.invoke(FastMethodInvoker.java:38)
> 	at org.apache.geronimo.gbean.runtime.GBeanOperation.invoke(GBeanOperation.java:118)
> 	at org.apache.geronimo.gbean.runtime.GBeanInstance.invoke(GBeanInstance.java:800)
> 	at org.apache.geronimo.gbean.runtime.RawInvoker.invoke(RawInvoker.java:57)
> 	at org.apache.geronimo.kernel.basic.RawOperationInvoker.invoke(RawOperationInvoker.java:36)
> 	at org.apache.geronimo.kernel.basic.ProxyMethodInterceptor.intercept(ProxyMethodInterceptor.java:96)
> 	at org.apache.geronimo.tomcat.TomcatContainer$$EnhancerByCGLIB$$9a1cf8ff.addContext(<generated>)
> 	at org.apache.geronimo.tomcat.TomcatWebAppContext.doStart(TomcatWebAppContext.java:462)
> 	at org.apache.geronimo.gbean.runtime.GBeanInstance.createInstance(GBeanInstance.java:936)
> 	at org.apache.geronimo.gbean.runtime.GBeanInstanceState.attemptFullStart(GBeanInstanceState.java:325)
> 	at org.apache.geronimo.gbean.runtime.GBeanInstanceState.start(GBeanInstanceState.java:110)
> 	at org.apache.geronimo.gbean.runtime.GBeanInstanceState.startRecursive(GBeanInstanceState.java:132)
> 	at org.apache.geronimo.gbean.runtime.GBeanInstance.startRecursive(GBeanInstance.java:537)
> 	at org.apache.geronimo.kernel.basic.BasicKernel.startRecursiveGBean(BasicKernel.java:208)
> 	at org.apache.geronimo.kernel.config.Configuration.startRecursiveGBeans(Configuration.java:315)
> 	at org.apache.geronimo.kernel.config.Configuration$$FastClassByCGLIB$$7f4b4a9b.invoke(<generated>)
> 	at net.sf.cglib.reflect.FastMethod.invoke(FastMethod.java:53)
> 	at org.apache.geronimo.gbean.runtime.FastMethodInvoker.invoke(FastMethodInvoker.java:38)
> 	at org.apache.geronimo.gbean.runtime.GBeanOperation.invoke(GBeanOperation.java:118)
> 	at org.apache.geronimo.gbean.runtime.GBeanInstance.invoke(GBeanInstance.java:835)
> 	at org.apache.geronimo.kernel.basic.BasicKernel.invoke(BasicKernel.java:178)
> 	at org.apache.geronimo.kernel.basic.BasicKernel.invoke(BasicKernel.java:173)
> 	at org.apache.geronimo.tomcat.deployment.TomcatModuleBuilderTest.deployWar(TomcatModuleBuilderTest.java:217)
> 	at org.apache.geronimo.tomcat.deployment.TomcatModuleBuilderTest.testDeployWar4(TomcatModuleBuilderTest.java:147)
> 	at sun.reflect.NativeMethodAccessorImpl.invoke0(Native Method)
> 	at sun.reflect.NativeMethodAccessorImpl.invoke(NativeMethodAccessorImpl.java:39)
> 	at sun.reflect.DelegatingMethodAccessorImpl.invoke(DelegatingMethodAccessorImpl.java:25)
> 	at java.lang.reflect.Method.invoke(Method.java:324)
> 	at junit.framework.TestCase.runTest(TestCase.java:154)
> 	at junit.framework.TestCase.runBare(TestCase.java:127)
> 	at junit.framework.TestResult$1.protect(TestResult.java:106)
> 	at junit.framework.TestResult.runProtected(TestResult.java:124)
> 	at junit.framework.TestResult.run(TestResult.java:109)
> 	at junit.framework.TestCase.run(TestCase.java:118)
> 	at junit.framework.TestSuite.runTest(TestSuite.java:208)
> 	at junit.framework.TestSuite.run(TestSuite.java:203)
> 	at org.apache.tools.ant.taskdefs.optional.junit.JUnitTestRunner.run(JUnitTestRunner.java:325)
> 	at org.apache.tools.ant.taskdefs.optional.junit.JUnitTestRunner.main(JUnitTestRunner.java:536)
> Jan 11, 2006 10:42:47 AM org.apache.catalina.core.StandardContext start
> SEVERE: Error in resourceStart()
> Jan 11, 2006 10:42:47 AM org.apache.catalina.core.StandardContext start
> SEVERE: Error getConfigured
> Jan 11, 2006 10:42:47 AM org.apache.catalina.core.StandardContext start
> SEVERE: Context [/test] startup failed due to previous errors
> Jan 11, 2006 10:42:50 AM org.apache.catalina.core.StandardContext resourcesStart
> SEVERE: Error starting static Resources
> java.lang.IllegalArgumentException: Document base D:\anita\geronimo\geronimo-1.0\modules\tomcat-builder\src\test-resources\deployables\war5\war
does not exist or is not a readable directory
> 	at org.apache.naming.resources.FileDirContext.setDocBase(FileDirContext.java:140)
> 	at org.apache.catalina.core.StandardContext.resourcesStart(StandardContext.java:3754)
> 	at org.apache.catalina.core.StandardContext.start(StandardContext.java:3925)
> 	at org.apache.geronimo.tomcat.GeronimoStandardContext.access$101(GeronimoStandardContext.java:64)
> 	at org.apache.geronimo.tomcat.GeronimoStandardContext$SystemMethodValve.invoke(GeronimoStandardContext.java:257)
> 	at org.apache.geronimo.tomcat.valve.TransactionContextValve.invoke(TransactionContextValve.java:53)
> 	at org.apache.geronimo.tomcat.valve.ComponentContextValve.invoke(ComponentContextValve.java:47)
> 	at org.apache.geronimo.tomcat.valve.InstanceContextValve.invoke(InstanceContextValve.java:60)
> 	at org.apache.geronimo.tomcat.GeronimoStandardContext.start(GeronimoStandardContext.java:173)
> 	at org.apache.catalina.core.ContainerBase.addChildInternal(ContainerBase.java:759)
> 	at org.apache.catalina.core.ContainerBase.addChild(ContainerBase.java:739)
> 	at org.apache.catalina.core.StandardHost.addChild(StandardHost.java:524)
> 	at org.apache.geronimo.tomcat.TomcatContainer.addContext(TomcatContainer.java:287)
> 	at org.apache.geronimo.tomcat.TomcatContainer$$FastClassByCGLIB$$9370b073.invoke(<generated>)
> 	at net.sf.cglib.reflect.FastMethod.invoke(FastMethod.java:53)
> 	at org.apache.geronimo.gbean.runtime.FastMethodInvoker.invoke(FastMethodInvoker.java:38)
> 	at org.apache.geronimo.gbean.runtime.GBeanOperation.invoke(GBeanOperation.java:118)
> 	at org.apache.geronimo.gbean.runtime.GBeanInstance.invoke(GBeanInstance.java:800)
> 	at org.apache.geronimo.gbean.runtime.RawInvoker.invoke(RawInvoker.java:57)
> 	at org.apache.geronimo.kernel.basic.RawOperationInvoker.invoke(RawOperationInvoker.java:36)
> 	at org.apache.geronimo.kernel.basic.ProxyMethodInterceptor.intercept(ProxyMethodInterceptor.java:96)
> 	at org.apache.geronimo.tomcat.TomcatContainer$$EnhancerByCGLIB$$9a1cf8ff.addContext(<generated>)
> 	at org.apache.geronimo.tomcat.TomcatWebAppContext.doStart(TomcatWebAppContext.java:462)
> 	at org.apache.geronimo.gbean.runtime.GBeanInstance.createInstance(GBeanInstance.java:936)
> 	at org.apache.geronimo.gbean.runtime.GBeanInstanceState.attemptFullStart(GBeanInstanceState.java:325)
> 	at org.apache.geronimo.gbean.runtime.GBeanInstanceState.start(GBeanInstanceState.java:110)
> 	at org.apache.geronimo.gbean.runtime.GBeanInstanceState.startRecursive(GBeanInstanceState.java:132)
> 	at org.apache.geronimo.gbean.runtime.GBeanInstance.startRecursive(GBeanInstance.java:537)
> 	at org.apache.geronimo.kernel.basic.BasicKernel.startRecursiveGBean(BasicKernel.java:208)
> 	at org.apache.geronimo.kernel.config.Configuration.startRecursiveGBeans(Configuration.java:315)
> 	at org.apache.geronimo.kernel.config.Configuration$$FastClassByCGLIB$$7f4b4a9b.invoke(<generated>)
> 	at net.sf.cglib.reflect.FastMethod.invoke(FastMethod.java:53)
> 	at org.apache.geronimo.gbean.runtime.FastMethodInvoker.invoke(FastMethodInvoker.java:38)
> 	at org.apache.geronimo.gbean.runtime.GBeanOperation.invoke(GBeanOperation.java:118)
> 	at org.apache.geronimo.gbean.runtime.GBeanInstance.invoke(GBeanInstance.java:835)
> 	at org.apache.geronimo.kernel.basic.BasicKernel.invoke(BasicKernel.java:178)
> 	at org.apache.geronimo.kernel.basic.BasicKernel.invoke(BasicKernel.java:173)
> 	at org.apache.geronimo.tomcat.deployment.TomcatModuleBuilderTest.deployWar(TomcatModuleBuilderTest.java:194)
> 	at org.apache.geronimo.tomcat.deployment.TomcatModuleBuilderTest.testDeployWar5(TomcatModuleBuilderTest.java:151)
> 	at sun.reflect.NativeMethodAccessorImpl.invoke0(Native Method)
> 	at sun.reflect.NativeMethodAccessorImpl.invoke(NativeMethodAccessorImpl.java:39)
> 	at sun.reflect.DelegatingMethodAccessorImpl.invoke(DelegatingMethodAccessorImpl.java:25)
> 	at java.lang.reflect.Method.invoke(Method.java:324)
> 	at junit.framework.TestCase.runTest(TestCase.java:154)
> 	at junit.framework.TestCase.runBare(TestCase.java:127)
> 	at junit.framework.TestResult$1.protect(TestResult.java:106)
> 	at junit.framework.TestResult.runProtected(TestResult.java:124)
> 	at junit.framework.TestResult.run(TestResult.java:109)
> 	at junit.framework.TestCase.run(TestCase.java:118)
> 	at junit.framework.TestSuite.runTest(TestSuite.java:208)
> 	at junit.framework.TestSuite.run(TestSuite.java:203)
> 	at org.apache.tools.ant.taskdefs.optional.junit.JUnitTestRunner.run(JUnitTestRunner.java:325)
> 	at org.apache.tools.ant.taskdefs.optional.junit.JUnitTestRunner.main(JUnitTestRunner.java:536)
> Jan 11, 2006 10:42:50 AM org.apache.catalina.core.StandardContext start
> SEVERE: Error in resourceStart()
> Jan 11, 2006 10:42:50 AM org.apache.catalina.core.StandardContext start
> SEVERE: Error getConfigured
> Jan 11, 2006 10:42:50 AM org.apache.catalina.core.StandardContext start
> SEVERE: Context [/hello] startup failed due to previous errors
> Jan 11, 2006 10:42:50 AM org.apache.catalina.core.StandardContext resourcesStart
> SEVERE: Error starting static Resources
> java.lang.IllegalArgumentException: Document base D:\anita\geronimo\geronimo-1.0\modules\tomcat-builder\src\test-resources\deployables\war5\war
does not exist or is not a readable directory
> 	at org.apache.naming.resources.FileDirContext.setDocBase(FileDirContext.java:140)
> 	at org.apache.catalina.core.StandardContext.resourcesStart(StandardContext.java:3754)
> 	at org.apache.catalina.core.StandardContext.start(StandardContext.java:3925)
> 	at org.apache.geronimo.tomcat.GeronimoStandardContext.access$101(GeronimoStandardContext.java:64)
> 	at org.apache.geronimo.tomcat.GeronimoStandardContext$SystemMethodValve.invoke(GeronimoStandardContext.java:257)
> 	at org.apache.geronimo.tomcat.valve.TransactionContextValve.invoke(TransactionContextValve.java:53)
> 	at org.apache.geronimo.tomcat.valve.ComponentContextValve.invoke(ComponentContextValve.java:47)
> 	at org.apache.geronimo.tomcat.valve.InstanceContextValve.invoke(InstanceContextValve.java:60)
> 	at org.apache.geronimo.tomcat.GeronimoStandardContext.start(GeronimoStandardContext.java:173)
> 	at org.apache.catalina.core.ContainerBase.addChildInternal(ContainerBase.java:759)
> 	at org.apache.catalina.core.ContainerBase.addChild(ContainerBase.java:739)
> 	at org.apache.catalina.core.StandardHost.addChild(StandardHost.java:524)
> 	at org.apache.geronimo.tomcat.TomcatContainer.addContext(TomcatContainer.java:287)
> 	at org.apache.geronimo.tomcat.TomcatContainer$$FastClassByCGLIB$$9370b073.invoke(<generated>)
> 	at net.sf.cglib.reflect.FastMethod.invoke(FastMethod.java:53)
> 	at org.apache.geronimo.gbean.runtime.FastMethodInvoker.invoke(FastMethodInvoker.java:38)
> 	at org.apache.geronimo.gbean.runtime.GBeanOperation.invoke(GBeanOperation.java:118)
> 	at org.apache.geronimo.gbean.runtime.GBeanInstance.invoke(GBeanInstance.java:800)
> 	at org.apache.geronimo.gbean.runtime.RawInvoker.invoke(RawInvoker.java:57)
> 	at org.apache.geronimo.kernel.basic.RawOperationInvoker.invoke(RawOperationInvoker.java:36)
> 	at org.apache.geronimo.kernel.basic.ProxyMethodInterceptor.intercept(ProxyMethodInterceptor.java:96)
> 	at org.apache.geronimo.tomcat.TomcatContainer$$EnhancerByCGLIB$$9a1cf8ff.addContext(<generated>)
> 	at org.apache.geronimo.tomcat.TomcatWebAppContext.doStart(TomcatWebAppContext.java:462)
> 	at org.apache.geronimo.gbean.runtime.GBeanInstance.createInstance(GBeanInstance.java:936)
> 	at org.apache.geronimo.gbean.runtime.GBeanInstanceState.attemptFullStart(GBeanInstanceState.java:325)
> 	at org.apache.geronimo.gbean.runtime.GBeanInstanceState.start(GBeanInstanceState.java:110)
> 	at org.apache.geronimo.gbean.runtime.GBeanInstanceState.startRecursive(GBeanInstanceState.java:132)
> 	at org.apache.geronimo.gbean.runtime.GBeanInstance.startRecursive(GBeanInstance.java:537)
> 	at org.apache.geronimo.kernel.basic.BasicKernel.startRecursiveGBean(BasicKernel.java:208)
> 	at org.apache.geronimo.kernel.config.Configuration.startRecursiveGBeans(Configuration.java:315)
> 	at org.apache.geronimo.kernel.config.Configuration$$FastClassByCGLIB$$7f4b4a9b.invoke(<generated>)
> 	at net.sf.cglib.reflect.FastMethod.invoke(FastMethod.java:53)
> 	at org.apache.geronimo.gbean.runtime.FastMethodInvoker.invoke(FastMethodInvoker.java:38)
> 	at org.apache.geronimo.gbean.runtime.GBeanOperation.invoke(GBeanOperation.java:118)
> 	at org.apache.geronimo.gbean.runtime.GBeanInstance.invoke(GBeanInstance.java:835)
> 	at org.apache.geronimo.kernel.basic.BasicKernel.invoke(BasicKernel.java:178)
> 	at org.apache.geronimo.kernel.basic.BasicKernel.invoke(BasicKernel.java:173)
> 	at org.apache.geronimo.tomcat.deployment.TomcatModuleBuilderTest.deployWar(TomcatModuleBuilderTest.java:217)
> 	at org.apache.geronimo.tomcat.deployment.TomcatModuleBuilderTest.testDeployWar5(TomcatModuleBuilderTest.java:151)
> 	at sun.reflect.NativeMethodAccessorImpl.invoke0(Native Method)
> 	at sun.reflect.NativeMethodAccessorImpl.invoke(NativeMethodAccessorImpl.java:39)
> 	at sun.reflect.DelegatingMethodAccessorImpl.invoke(DelegatingMethodAccessorImpl.java:25)
> 	at java.lang.reflect.Method.invoke(Method.java:324)
> 	at junit.framework.TestCase.runTest(TestCase.java:154)
> 	at junit.framework.TestCase.runBare(TestCase.java:127)
> 	at junit.framework.TestResult$1.protect(TestResult.java:106)
> 	at junit.framework.TestResult.runProtected(TestResult.java:124)
> 	at junit.framework.TestResult.run(TestResult.java:109)
> 	at junit.framework.TestCase.run(TestCase.java:118)
> 	at junit.framework.TestSuite.runTest(TestSuite.java:208)
> 	at junit.framework.TestSuite.run(TestSuite.java:203)
> 	at org.apache.tools.ant.taskdefs.optional.junit.JUnitTestRunner.run(JUnitTestRunner.java:325)
> 	at org.apache.tools.ant.taskdefs.optional.junit.JUnitTestRunner.main(JUnitTestRunner.java:536)
> Jan 11, 2006 10:42:50 AM org.apache.catalina.core.StandardContext start
> SEVERE: Error in resourceStart()
> Jan 11, 2006 10:42:50 AM org.apache.catalina.core.StandardContext start
> SEVERE: Error getConfigured
> Jan 11, 2006 10:42:50 AM org.apache.catalina.core.StandardContext start
> SEVERE: Context [/hello] startup failed due to previous errors
> ------------- ---------------- ---------------

Mime
View raw message