geronimo-dev mailing list archives

Site index · List index
Message view « Date » · « Thread »
Top « Date » · « Thread »
From "Aaron Mulder (JIRA)" <...@geronimo.apache.org>
Subject [jira] Closed: (GERONIMO-1117) [Build break] junit tests in openejb failed.
Date Sun, 11 Dec 2005 03:47:11 GMT
     [ http://issues.apache.org/jira/browse/GERONIMO-1117?page=all ]
     
Aaron Mulder closed GERONIMO-1117:
----------------------------------

    Fix Version: 1.0
     Resolution: Cannot Reproduce
      Assign To: Aaron Mulder

Does not seem to be happening in the current build.

> [Build break] junit tests in openejb failed.
> --------------------------------------------
>
>          Key: GERONIMO-1117
>          URL: http://issues.apache.org/jira/browse/GERONIMO-1117
>      Project: Geronimo
>         Type: Bug
>   Components: OpenEJB
>     Versions: 1.0-M5
>  Environment: Windows XP,  Pentium 4 3Ghz, 2 GB RAM
>     Reporter: Prasad Kashyap
>     Assignee: Aaron Mulder
>      Fix For: 1.0
>  Attachments: build-all2.log
>
>     [junit] [ERROR] TEST org.openejb.test.security.slsb.BasicStatelessScenario002Tests
FAILED
>     [junit] Running org.openejb.test.stateful.StatefulTestSuite
> Error closing connection with server: null
> .....
> .....
> Error closing connection with server: null
>     [junit] Tests run: 0, Failures: 0, Errors: 13, Time elapsed: 0.251 sec
>     [junit] [ERROR] TEST org.openejb.test.stateful.StatefulTestSuite FAILED
>     [junit] Running org.openejb.test.stateless.StatelessTestSuite
> Error closing connection with server: null
> .......
> .......
> Error closing connection with server: null
>     [junit] Tests run: 0, Failures: 0, Errors: 14, Time elapsed: 0.631 sec
>     [junit] [ERROR] TEST org.openejb.test.stateless.StatelessTestSuite FAILED
> Completed
> Module org/openejb/cmp2/CMRMapping uninstalled.
> Completed
> Completed
> Module org/openejb/cmp2/Storage uninstalled.
> Completed
> Completed
> Module org/openejb/cmp2/petstore uninstalled.
> Completed
> Completed
> Module org/openejb/cmp2/Prefetch uninstalled.
> Completed
> Completed
> Completed
> Module org/openejb/scenario002 uninstalled.
> Completed
> 12:09:38,135 ERROR [GBeanInstance] GBeanInstance should already be stopped before die()
is called: objectName=geronimo.server:EJBModule=org/openejb/scenario001,J2EEApplication=null,J2EEServer=geronimo,j2eeType=StatelessSessionBean,name=BasicStatelessBean
state=stopping
> Completed
> Completed
> Module org/openejb/Itests uninstalled.
> Completed
> itest:teardown:
>     [echo] undeployed ejbs
> 12:10:28,467 ERROR [GBeanInstance] GBeanInstance should already be stopped before die()
is called: objectName=geronimo.server:J2EEApplication=null,J2EEModule=org/openejb/Security,J2EEServer=geronimo,j2eeType=CORBACSS,name=IOR7
state=starting
> 12:10:28,477 ERROR [GBeanInstance] GBeanInstance should already be stopped before die()
is called: objectName=geronimo.server:J2EEApplication=null,J2EEModule=org/openejb/Security,J2EEServer=geronimo,j2eeType=CORBATSS,name=org/openejb/Itests
state=starting
>     [echo] server has stopped
> BUILD FAILED
> File...... C:\Documents and Settings\Administrator\.maven\cache\maven-multiproject-plugin-1.3.1\plugin.jelly
> Element... maven:reactor
> Line...... 217
> Column.... 9
> Unable to obtain goal [ejb:install] -- C:\Documents and Settings\Administrator\.maven\cache\maven-itest-plugin-1.0\plugin.jelly:166:64:
<fail> There were test failures.
> Server shutdown begun              

-- 
This message is automatically generated by JIRA.
-
If you think it was sent incorrectly contact one of the administrators:
   http://issues.apache.org/jira/secure/Administrators.jspa
-
For more information on JIRA, see:
   http://www.atlassian.com/software/jira


Mime
View raw message