geronimo-dev mailing list archives

Site index · List index
Message view « Date » · « Thread »
Top « Date » · « Thread »
From David Blevins <david.blev...@visi.com>
Subject Re: [continuum] BUILD FAILURE: Geronimo
Date Wed, 30 Nov 2005 19:53:43 GMT

On Nov 30, 2005, at 11:41 AM, continuum wrote:

> http://ci.gbuild.org/continuum/target/ProjectBuild.vm/view/ 
> ProjectBuild/id/1/buildId/196
>

Getting this failure from the build.  Any ideas on what I need to do  
to get a build to go?

-David

test:prepare-filesystem:

test:test-resources:
Running post goal: test:test-resources
     [delete] Deleting directory /home/continuum/build/work/1/modules/ 
security/target/database
     [mkdir] Created dir: /home/continuum/build/work/1/modules/ 
security/target/database

test:compile:

test:test:
     [junit] Running org.apache.geronimo.security.ContextManagerTest
     [junit] Tests run: 1, Failures: 0, Errors: 0, Time elapsed:  
0.718 sec
     [junit] Running  
org.apache.geronimo.security.jaas.ConfigurationEntryTest
     [junit] Tests run: 1, Failures: 0, Errors: 0, Time elapsed:  
1.703 sec
     [junit] Running  
org.apache.geronimo.security.jaas.LoginKerberosNonGeronimoTest
     [junit] Tests run: 1, Failures: 0, Errors: 0, Time elapsed: 1.26  
sec
     [junit] Running org.apache.geronimo.security.jaas.LoginKerberosTest
     [junit] Tests run: 1, Failures: 0, Errors: 0, Time elapsed:  
1.215 sec
     [junit] Running  
org.apache.geronimo.security.jaas.LoginPropertiesFileTest
     [junit] Tests run: 5, Failures: 0, Errors: 1, Time elapsed:  
1.758 sec
     [junit] [ERROR] Test  
org.apache.geronimo.security.jaas.LoginPropertiesFileTest FAILED
     [junit] Running org.apache.geronimo.security.jaas.LoginSQLTest
     [junit] Tests run: 3, Failures: 0, Errors: 1, Time elapsed:  
1.835 sec
     [junit] [ERROR] Test  
org.apache.geronimo.security.jaas.LoginSQLTest FAILED
     [junit] Running  
org.apache.geronimo.security.jaas.MultipleLoginDomainTest
     [junit] Tests run: 2, Failures: 0, Errors: 0, Time elapsed:  
0.348 sec
     [junit] Running  
org.apache.geronimo.security.jaas.NoLoginModuleReuseTest
     [junit] Tests run: 1, Failures: 0, Errors: 0, Time elapsed:  
0.345 sec
     [junit] Running org.apache.geronimo.security.jaas.TimeoutTest
     [junit] Tests run: 2, Failures: 0, Errors: 1, Time elapsed:  
1.442 sec
     [junit] [ERROR] Test  
org.apache.geronimo.security.jaas.TimeoutTest FAILED
     [junit] Running  
org.apache.geronimo.security.jacc.GeronimoPolicyConfigurationFactoryTest
     [junit] Tests run: 2, Failures: 0, Errors: 0, Time elapsed:  
0.316 sec
     [junit] Running  
org.apache.geronimo.security.network.protocol.SubjectCarryingProtocolTes 
t
     [junit] Tests run: 1, Failures: 0, Errors: 1, Time elapsed:  
1.209 sec
     [junit] [ERROR] Test  
org.apache.geronimo.security.network.protocol.SubjectCarryingProtocolTes 
t FAILED
     [junit] Running  
org.apache.geronimo.security.remoting.jmx.RemoteLoginTest
     [junit] Tests run: 1, Failures: 0, Errors: 1, Time elapsed:  
1.256 sec
     [junit] [ERROR] Test  
org.apache.geronimo.security.remoting.jmx.RemoteLoginTest FAILED

BUILD FAILED
File...... /home/continuum/.maven/cache/maven-multiproject- 
plugin-1.4.1/plugin.jelly
Element... maven:reactor
Line...... 218
Column.... -1
Unable to obtain goal [default] -- /home/continuum/.maven/cache/maven- 
test-plugin-1.7/plugin.jelly:183:-1:  There were test failures.
Total time   : 1 minutes 37 seconds
Finished at  : Wednesday, November 30, 2005 11:41:42 AM PST

Mime
View raw message