geronimo-dev mailing list archives

Site index · List index
Message view « Date » · « Thread »
Top « Date » · « Thread »
From Jeff Genender <jgenen...@savoirtech.com>
Subject Re: Tomcat tests failing in HEAD
Date Thu, 21 Jul 2005 04:20:12 GMT
Not from a Tomcat perspective.

sissonj@insession.com wrote:
> Is this expected at the moment?
> 
> test:test:
>     [mkdir] Created dir: 
> C:\geronimo_contrib\geronimo\modules\tomcat\target\endorsed
>     [mkdir] Created dir: 
> C:\geronimo_contrib\geronimo\modules\tomcat\target\var
>     [mkdir] Created dir: 
> C:\geronimo_contrib\geronimo\modules\tomcat\target\var\catalina
>     [mkdir] Created dir: 
> C:\geronimo_contrib\geronimo\modules\tomcat\target\var\catalina\webapps
>     [mkdir] Created dir: 
> C:\geronimo_contrib\geronimo\modules\tomcat\target\var\catalina\conf
>     [copy] Copying 1 file to 
> C:\geronimo_contrib\geronimo\modules\tomcat\target\var\catalina\conf
>     [copy] Copying 8 files to 
> C:\geronimo_contrib\geronimo\modules\tomcat\target\var\catalina\webapps
>     [copy] Copying 1 file to 
> C:\geronimo_contrib\geronimo\modules\tomcat\target\endorsed
>     [copy] Copying 1 file to 
> C:\geronimo_contrib\geronimo\modules\tomcat\target\endorsed
>     [junit] Running org.apache.geronimo.tomcat.ApplicationTest
>     [junit] Tests run: 1, Failures: 1, Errors: 0, Time elapsed: 2.155 sec
>     [junit] [ERROR] TEST org.apache.geronimo.tomcat.ApplicationTest FAILED
>     [junit] Running org.apache.geronimo.tomcat.ContainerTest
>     [junit] Tests run: 2, Failures: 1, Errors: 1, Time elapsed: 2.046 sec
>     [junit] [ERROR] TEST org.apache.geronimo.tomcat.ContainerTest FAILED
>     [junit] Running org.apache.geronimo.tomcat.JAASSecurityTest
>     [junit] Tests run: 3, Failures: 1, Errors: 2, Time elapsed: 2.046 sec
>     [junit] [ERROR] TEST org.apache.geronimo.tomcat.JAASSecurityTest 
> FAILED
>     [junit] Running org.apache.geronimo.tomcat.JACCSecurityTest
>     [junit] Tests run: 1, Failures: 1, Errors: 0, Time elapsed: 1.999 sec
>     [junit] [ERROR] TEST org.apache.geronimo.tomcat.JACCSecurityTest 
> FAILED
> 
> John
> 
> This e-mail message and any attachments may contain confidential, 
> proprietary or non-public information.  This information is intended 
> solely for the designated recipient(s).  If an addressing or transmission 
> error has misdirected this e-mail, please notify the sender immediately 
> and destroy this e-mail.  Any review, dissemination, use or reliance upon 
> this information by unintended recipients is prohibited.  Any opinions 
> expressed in this e-mail are those of the author personally.

Mime
View raw message