geronimo-dev mailing list archives

Site index · List index
Message view « Date » · « Thread »
Top « Date » · « Thread »
From Yoseph Widjaya <yosep...@yahoo.com>
Subject Re: Could not build geronimo rev 189685
Date Fri, 10 Jun 2005 02:28:10 GMT
Dear 

It's seems that mine is failed when compiling the
timer modules dunno why.  same message I copied the
message hopefully someone can track the trouble 

here are the stack trace

test:prepare-filesystem:
    [mkdir] Created dir:
/home/yosep/geronimo/modules/timer/target/test-classes
    [mkdir] Created dir:
/home/yosep/geronimo/modules/timer/target/test-reports
 
test:test-resources:
 
test:compile:
    [javac] Compiling 6 source files to
/home/yosep/geronimo/modules/timer/target/test-classes
 
test:test:
    [junit] Running
org.apache.geronimo.timer.TransactionalThreadPooledTimerTest
   [junit] Tests run: 10, Failures: 1, Errors: 0, Time
elapsed: 30.886 sec
    [junit] [ERROR] TEST
org.apache.geronimo.timer.TransactionalThreadPooledTimerTest
FAILED
    [junit] Running
org.apache.geronimo.timer.jdbc.AxionJDBCWorkerPersistenceTest
    [junit] Tests run: 3, Failures: 0, Errors: 0, Time
elapsed: 5.746 sec
    [junit] Running
org.apache.geronimo.timer.jdbc.DerbyJDBCWorkerPersistenceTest
    [junit] Tests run: 3, Failures: 0, Errors: 0, Time
elapsed: 49.001 sec
    [junit] Running
org.apache.geronimo.timer.NontransactionalThreadPooledTimerTest
    [junit] Tests run: 10, Failures: 0, Errors: 0,
Time elapsed: 25.887 sec
 
BUILD FAILED
File......
/home/yosep/.maven/cache/maven-multiproject-plugin-1.3.1/plugin.jellyElement...
maven:reactor
Line...... 217
Column.... 9
Unable to obtain goal [default] --
/home/yosep/.maven/cache/maven-test-plugin-1.6.2/plugin.jelly:181:54:
<fail> There were test failures.
Total time: 51 minutes 58 seconds
Finished at: Fri Jun 10 11:57:16 EST 2005

many thanks

--- Matt Hogstrom <matt@hogstrom.org> wrote:

> Dondi, 
> 
> I have the jar I'll send to you directly as to not
> pollute the list.  It goes in
> .maven\repository\cglib\jars
> 
> 
> ----- Original Message ----- 
> From: "Dondi Imperial" <dimperial@exist.com>
> To: <dev@geronimo.apache.org>
> Sent: Thursday, June 09, 2005 8:54 PM
> Subject: Re: Could not build geronimo rev 189685
> 
> 
> > It still doesn't work for me. It fails to download
> 
> > cglib-nodep-HEAD-06-06-05.jar in the geronimo ::
> kernel module. I tried 
> > this a couple of times and got the same result.
> Funny thing though, I 
> > tried building just the kernel module by cding
> into the modules/kernel 
> > folder then typing maven and this worked. It did
> download the cglib jar.
> > 
> > HTH,
> > 
> > Dain Sundstrom wrote:
> > 
> >> Has this been resolved for everyone?
> >>
> >> I just double checked the permissions on the
> repository and it looks  
> >> good.  If this problem happens to you can you
> make sure to post which  
> >> module failed.
> >>
> >> Thanks,
> >>
> >> -dain
> >>
> >> On Jun 8, 2005, at 10:03 PM, Matt Hogstrom wrote:
> >>
> >>> I just rebuilt from scratch about an hour ago
> and everything worked  ok.
> >>>
> >>> ----- Original Message ----- From: "Yoseph
> Widjaya"  
> >>> <yosephwk@yahoo.com>
> >>>
> >>>> Hi Geronimoer
> >>>>
> >>>> Same thing happen to me cannot build the
> geronimo
> >>>> server any idea ????
> >>>>
> >>>> also for helping in building geronimo any idea
> where i
> >>>> can help
> >>>>
> >>>> many thank
> >>>>
> >>>> Yosep
> >>>> --- Dondi Imperial <dimperial@exist.com> wrote:
> >>>>
> >>>>
> >>>>> I could not build geronimo rev 189685 using
> the "For
> >>>>> the impatient..."
> >>>>> instructions on the wiki. I tried looking for
> the
> >>>>> offending jar in
> >>>>> ibiblio and sourceforge but could not see it
> there
> >>>>> either. Here is the
> >>>>> failure message.
> >>>>>
> >>>>> BUILD FAILED
> >>>>> File...... C:\Documents and
> >>>>>
> >>>>>
> >>>>
>
Settings\exist_user2\.maven\cache\maven-multiproject-plugin-1.3.1
> 
> >>>> \plugin
> >>>>
> >>>>> .jelly
> >>>>> Element... maven:reactor
> >>>>> Line...... 217
> >>>>> Column.... 9
> >>>>> The build cannot continue because of the
> following
> >>>>> unsatisfied dependency:
> >>>>>
> >>>>> cglib-nodep-HEAD-06-06-05.jar (try downloading
> from
> >>>>> http://cglib.sf.net/)
> >>>>>
> >>>>> -- 
> >>>>> Dondi Imperial
> >>>>> Software Engineer
> >>>>> Exist Software Labs
> >>>>> Marketing Coordinator
> >>>>> Penthouse I, Prestige Tower,
> >>>>> F. Ortigas Jr. Ave. (formerly Emerald Ave.),
> >>>>> Ortigas Center, Pasig City 1605
> >>>>> Philippines
> >>>>> +632.687.7653
> >>>>> www.exist.com
> >>>>>
> >>>>>
> >>>>>
> >>>>>
> >>>>
> >>>>
> >>>>
> >>>>
> >>>> __________________________________
> >>>> Discover Yahoo!
> >>>> Find restaurants, movies, travel and more fun
> for the weekend.  
> >>>> Check it out!
> >>>> http://discover.yahoo.com/weekend.html
> >>>>
> >>>>
> >>>
> >>
> > 
> > 
> > -- 
> > Dondi Imperial
> > Software Engineer
> > Exist Software Labs
> > Penthouse I, Prestige Tower,
> > F. Ortigas Jr. Ave. (formerly Emerald Ave.),
> > Ortigas Center, Pasig City 1605
> > Philippines 
> > +632.687.7653
> > www.exist.com
> > 
> > 
> > 
> >



		
__________________________________ 
Yahoo! Mail 
Stay connected, organized, and protected. Take the tour: 
http://tour.mail.yahoo.com/mailtour.html 


Mime
View raw message