geronimo-dev mailing list archives

Site index · List index
Message view « Date » · « Thread »
Top « Date » · « Thread »
From "Katia Aresti Gonzalez" <kaare...@hotmail.com>
Subject Re: Build fail
Date Fri, 01 Apr 2005 01:02:12 GMT
<html><div style='background-color:'><DIV class=RTE>
<DIV class=RTE>Hi!!</DIV>
<DIV class=RTE>&nbsp;</DIV>
<DIV class=RTE>The enviroment I use is Windows XP Service Pack 2, and the JDK I use
is JDK1.4.2. </DIV>
<DIV class=RTE>I have delete the tomcat repository in maven, and i have used the clean
command and maven to build the server. Now, the build fails on the assembly part.... Im using
the last version of the source code of Geronimo, just got from subversion.&nbsp;</DIV>
<DIV class=RTE>Thanks a lot.</DIV>
<DIV class=RTE>&nbsp;</DIV>
<DIV class=RTE>Katia</DIV>
<DIV class=RTE>es </DIV>
<DIV></DIV>
<P>java:jar-resources: </P>
<DIV></DIV>
<DIV></DIV>
<P>test:prepare-filesystem: </P>
<DIV></DIV>
<P>&nbsp;&nbsp;&nbsp;&nbsp;[mkdir] Created dir: C:\geronimo\modules\tomcat\target\test-classes
</P>
<DIV></DIV>
<P>&nbsp;&nbsp;&nbsp;&nbsp;[mkdir] Created dir: C:\geronimo\modules\tomcat\target\test-reports
</P>
<DIV></DIV>
<DIV></DIV>
<P>test:test-resources: </P>
<DIV></DIV>
<DIV></DIV>
<P>test:compile: </P>
<DIV></DIV>
<P>&nbsp;&nbsp;&nbsp;&nbsp;[javac] Compiling 4 source files to C:\geronimo\modules\tomcat\target\test-c
</P>
<DIV></DIV>
<P>lasses </P>
<DIV></DIV>
<DIV></DIV>
<P>test:test: </P>
<DIV></DIV>
<P>&nbsp;&nbsp;&nbsp;&nbsp;[mkdir] Created dir: C:\geronimo\modules\tomcat\target\endorsed
</P>
<DIV></DIV>
<P>&nbsp;&nbsp;&nbsp;&nbsp;[mkdir] Created dir: C:\geronimo\modules\tomcat\target\var
</P>
<DIV></DIV>
<P>&nbsp;&nbsp;&nbsp;&nbsp;[mkdir] Created dir: C:\geronimo\modules\tomcat\target\var\catalina
</P>
<DIV></DIV>
<P>&nbsp;&nbsp;&nbsp;&nbsp;[mkdir] Created dir: C:\geronimo\modules\tomcat\target\var\catalina\webapps
</P>
<DIV></DIV>
<P>&nbsp;&nbsp;&nbsp;&nbsp;[mkdir] Created dir: C:\geronimo\modules\tomcat\target\var\catalina\conf
</P>
<DIV></DIV>
<P>&nbsp;&nbsp;&nbsp;&nbsp;[copy] Copying 1 file to C:\geronimo\modules\tomcat\target\var\catalina\conf
</P>
<DIV></DIV>
<DIV></DIV>
<P>&nbsp;&nbsp;&nbsp;&nbsp;[copy] Copying 8 files to C:\geronimo\modules\tomcat\target\var\catalina\web
</P>
<DIV></DIV>
<P>apps </P>
<DIV></DIV>
<P>&nbsp;&nbsp;&nbsp;&nbsp;[copy] Copying 1 file to C:\geronimo\modules\tomcat\target\endorsed
</P>
<DIV></DIV>
<P>&nbsp;&nbsp;&nbsp;&nbsp;[copy] Copying 1 file to C:\geronimo\modules\tomcat\target\endorsed
</P>
<DIV></DIV>
<P>&nbsp;&nbsp;&nbsp;&nbsp;[junit] Running org.apache.geronimo.tomcat.ApplicationTest
</P>
<DIV></DIV>
<P>&nbsp;&nbsp;&nbsp;&nbsp;[junit] Tests run: 2, Failures: 0, Errors:
0, Time elapsed: 3,891 sec </P>
<DIV></DIV>
<P>&nbsp;&nbsp;&nbsp;&nbsp;[junit] Running org.apache.geronimo.tomcat.JAASSecurityTest
</P>
<DIV></DIV>
<P>&nbsp;&nbsp;&nbsp;&nbsp;[junit] Tests run: 4, Failures: 0, Errors:
0, Time elapsed: 5,578 sec </P>
<DIV></DIV>
<P>&nbsp;&nbsp;&nbsp;&nbsp;[junit] Running org.apache.geronimo.tomcat.JACCSecurityTest
</P>
<DIV></DIV>
<P>&nbsp;&nbsp;&nbsp;&nbsp;[junit] Tests run: 2, Failures: 0, Errors:
0, Time elapsed: 4,344 sec </P>
<DIV></DIV>
<P>&nbsp;&nbsp;&nbsp;&nbsp;[touch] Creating C:\geronimo\modules\tomcat\target\test-reports\tstamp
</P>
<DIV></DIV>
<DIV></DIV>
<P>jar:jar: </P>
<DIV></DIV>
<P>&nbsp;&nbsp;&nbsp;&nbsp;[jar] Building jar: C:\geronimo\modules\tomcat\target\geronimo-tomcat-1.0-SN
</P>
<DIV></DIV>
<P>APSHOT.jar </P>
<DIV></DIV>
<P>Copying: from 'C:\geronimo\modules\tomcat\target\geronimo-tomcat-1.0-SNAPSHOT.ja
</P>
<DIV></DIV>
<P>r' to: 'C:\Documents and Settings\Katia\.maven\repository\geronimo\jars\geronimo
</P>
<DIV></DIV>
<P>-tomcat-1.0-SNAPSHOT.jar' </P>
<DIV></DIV>
<P>Copying: from 'C:\geronimo\modules\tomcat\project.xml' to: 'C:\Documents and Set
</P>
<DIV></DIV>
<P>tings\Katia\.maven\repository\geronimo\poms\geronimo-tomcat-1.0-SNAPSHOT.pom' </P>
<DIV></DIV>
<P>+---------------------------------------- </P>
<DIV></DIV>
<P>| Executing default Geronimo :: Mail </P>
<DIV></DIV>
<P>| Memory: 60M/86M </P>
<DIV></DIV>
<P>+---------------------------------------- </P>
<DIV></DIV>
<P>Intentando descargar geronimo-j2ee-1.0-SNAPSHOT.jar. </P>
<DIV></DIV>
<P>Artifact /geronimo/jars/geronimo-j2ee-1.0-SNAPSHOT.jar doesn't exists in remote </P>
<DIV></DIV>
<P>repository, but it exists locally </P>
<DIV></DIV>
<P>Intentando descargar geronimo-kernel-1.0-SNAPSHOT.jar. </P>
<DIV></DIV>
<P>Artifact /geronimo/jars/geronimo-kernel-1.0-SNAPSHOT.jar doesn't exists in remot
</P>
<DIV></DIV>
<P>e repository, but it exists locally </P>
<DIV></DIV>
<P>Intentando descargar geronimo-spec-javamail-1.3.1-SNAPSHOT.jar. </P>
<DIV></DIV>
<P>Intentando descargar geronimo-spec-activation-1.0.2-SNAPSHOT.jar. </P>
<DIV></DIV>
<DIV></DIV>
<P>jar:install: </P>
<DIV></DIV>
<DIV></DIV>
<DIV></DIV>
<DIV></DIV>
<P>build:end: </P>
<DIV></DIV>
<DIV></DIV>
<P>build:start: </P>
<DIV></DIV>
<DIV></DIV>
<P>default: </P>
<DIV></DIV>
<P>java:prepare-filesystem: </P>
<DIV></DIV>
<P>&nbsp;&nbsp;&nbsp;&nbsp;[mkdir] Created dir: C:\geronimo\modules\mail\target\classes
</P>
<DIV></DIV>
<DIV></DIV>
<P>java:compile: </P>
<DIV></DIV>
<P>&nbsp;&nbsp;&nbsp;&nbsp;[depend] Deleted 0 out of date files in 0
seconds </P>
<DIV></DIV>
<P>&nbsp;&nbsp;&nbsp;&nbsp;[echo] Compiling to C:\geronimo\modules\mail/target/classes
</P>
<DIV></DIV>
<P>&nbsp;&nbsp;&nbsp;&nbsp;[javac] Compiling 6 source files to C:\geronimo\modules\mail\target\classes
</P>
<DIV></DIV>
<DIV></DIV>
<P>java:jar-resources: </P>
<DIV></DIV>
<DIV></DIV>
<P>test:prepare-filesystem: </P>
<DIV></DIV>
<P>&nbsp;&nbsp;&nbsp;&nbsp;[mkdir] Created dir: C:\geronimo\modules\mail\target\test-classes
</P>
<DIV></DIV>
<P>&nbsp;&nbsp;&nbsp;&nbsp;[mkdir] Created dir: C:\geronimo\modules\mail\target\test-reports
</P>
<DIV></DIV>
<DIV></DIV>
<P>test:test-resources: </P>
<DIV></DIV>
<P>Copying 1 file to C:\geronimo\modules\mail\target\test-classes </P>
<DIV></DIV>
<DIV></DIV>
<P>test:compile: </P>
<DIV></DIV>
<P>&nbsp;&nbsp;&nbsp;&nbsp;[javac] Compiling 3 source files to C:\geronimo\modules\mail\target\test-cla
</P>
<DIV></DIV>
<P>sses </P>
<DIV></DIV>
<DIV></DIV>
<P>test:test: </P>
<DIV></DIV>
<P>&nbsp;&nbsp;&nbsp;&nbsp;[junit] Running org.apache.geronimo.mail.MailGBeanTest
</P>
<DIV></DIV>
<P>&nbsp;&nbsp;&nbsp;&nbsp;[junit] Tests run: 5, Failures: 0, Errors:
0, Time elapsed: 0,75 sec </P>
<DIV></DIV>
<P>&nbsp;&nbsp;&nbsp;&nbsp;[touch] Creating C:\geronimo\modules\mail\target\test-reports\tstamp
</P>
<DIV></DIV>
<DIV></DIV>
<P>jar:jar: </P>
<DIV></DIV>
<P>&nbsp;&nbsp;&nbsp;&nbsp;[jar] Building jar: C:\geronimo\modules\mail\target\geronimo-mail-1.0-SNAPSH
</P>
<DIV></DIV>
<P>OT.jar </P>
<DIV></DIV>
<P>Copying: from 'C:\geronimo\modules\mail\target\geronimo-mail-1.0-SNAPSHOT.jar' t
</P>
<DIV></DIV>
<P>o: 'C:\Documents and Settings\Katia\.maven\repository\geronimo\jars\geronimo-mai
</P>
<DIV></DIV>
<P>l-1.0-SNAPSHOT.jar' </P>
<DIV></DIV>
<P>Copying: from 'C:\geronimo\modules\mail\project.xml' to: 'C:\Documents and Setti
</P>
<DIV></DIV>
<P>ngs\Katia\.maven\repository\geronimo\poms\geronimo-mail-1.0-SNAPSHOT.pom' </P>
<DIV></DIV>
<P>+---------------------------------------- </P>
<DIV></DIV>
<P>| Executing default Geronimo :: Spring </P>
<DIV></DIV>
<P>| Memory: 71M/86M </P>
<DIV></DIV>
<P>+---------------------------------------- </P>
<DIV></DIV>
<P>Intentando descargar geronimo-kernel-1.0-SNAPSHOT.jar. </P>
<DIV></DIV>
<P>Artifact /geronimo/jars/geronimo-kernel-1.0-SNAPSHOT.jar doesn't exists in remot
</P>
<DIV></DIV>
<P>e repository, but it exists locally </P>
<DIV></DIV>
<DIV></DIV>
<P>jar:install: </P>
<DIV></DIV>
<DIV></DIV>
<DIV></DIV>
<P>build:end: </P>
<DIV></DIV>
<DIV></DIV>
<P>build:start: </P>
<DIV></DIV>
<DIV></DIV>
<P>default: </P>
<DIV></DIV>
<P>java:prepare-filesystem: </P>
<DIV></DIV>
<P>&nbsp;&nbsp;&nbsp;&nbsp;[mkdir] Created dir: C:\geronimo\modules\spring\target\classes
</P>
<DIV></DIV>
<DIV></DIV>
<P>java:compile: </P>
<DIV></DIV>
<P>&nbsp;&nbsp;&nbsp;&nbsp;[depend] Deleted 0 out of date files in 0
seconds </P>
<DIV></DIV>
<P>&nbsp;&nbsp;&nbsp;&nbsp;[echo] Compiling to C:\geronimo\modules\spring/target/classes
</P>
<DIV></DIV>
<P>&nbsp;&nbsp;&nbsp;&nbsp;[javac] Compiling 3 source files to C:\geronimo\modules\spring\target\classe
</P>
<DIV></DIV>
<P>s </P>
<DIV></DIV>
<DIV></DIV>
<P>java:jar-resources: </P>
<DIV></DIV>
<DIV></DIV>
<P>test:prepare-filesystem: </P>
<DIV></DIV>
<P>&nbsp;&nbsp;&nbsp;&nbsp;[mkdir] Created dir: C:\geronimo\modules\spring\target\test-classes
</P>
<DIV></DIV>
<P>&nbsp;&nbsp;&nbsp;&nbsp;[mkdir] Created dir: C:\geronimo\modules\spring\target\test-reports
</P>
<DIV></DIV>
<DIV></DIV>
<P>test:test-resources: </P>
<DIV></DIV>
<DIV></DIV>
<P>test:compile: </P>
<DIV></DIV>
<P>&nbsp;&nbsp;&nbsp;&nbsp;[javac] Compiling 1 source file to C:\geronimo\modules\spring\target\test-cl
</P>
<DIV></DIV>
<P>asses </P>
<DIV></DIV>
<DIV></DIV>
<P>test:test: </P>
<DIV></DIV>
<P>&nbsp;&nbsp;&nbsp;&nbsp;[junit] Running org.apache.geronimo.spring.SpringGBeanTest
</P>
<DIV></DIV>
<P>&nbsp;&nbsp;&nbsp;&nbsp;[junit] Tests run: 1, Failures: 0, Errors:
0, Time elapsed: 0 sec </P>
<DIV></DIV>
<P>&nbsp;&nbsp;&nbsp;&nbsp;[touch] Creating C:\geronimo\modules\spring\target\test-reports\tstamp
</P>
<DIV></DIV>
<DIV></DIV>
<P>jar:jar: </P>
<DIV></DIV>
<P>&nbsp;&nbsp;&nbsp;&nbsp;[jar] Building jar: C:\geronimo\modules\spring\target\geronimo-spring-1.0-SN
</P>
<DIV></DIV>
<P>APSHOT.jar </P>
<DIV></DIV>
<P>Copying: from 'C:\geronimo\modules\spring\target\geronimo-spring-1.0-SNAPSHOT.ja
</P>
<DIV></DIV>
<P>r' to: 'C:\Documents and Settings\Katia\.maven\repository\geronimo\jars\geronimo
</P>
<DIV></DIV>
<P>-spring-1.0-SNAPSHOT.jar' </P>
<DIV></DIV>
<P>Copying: from 'C:\geronimo\modules\spring\project.xml' to: 'C:\Documents and Set
</P>
<DIV></DIV>
<P>tings\Katia\.maven\repository\geronimo\poms\geronimo-spring-1.0-SNAPSHOT.pom' </P>
<DIV></DIV>
<P>+---------------------------------------- </P>
<DIV></DIV>
<P>| Executing default Geronimo :: Spring :: Builder </P>
<DIV></DIV>
<P>| Memory: 73M/86M </P>
<DIV></DIV>
<P>+---------------------------------------- </P>
<DIV></DIV>
<P>Intentando descargar geronimo-xmlbeans-plugin-1.0-SNAPSHOT.jar. </P>
<DIV></DIV>
<P>Intentando descargar geronimo-kernel-1.0-SNAPSHOT.jar. </P>
<DIV></DIV>
<P>Intentando descargar geronimo-deployment-1.0-SNAPSHOT.jar. </P>
<DIV></DIV>
<P>Intentando descargar geronimo-deploy-tool-1.0-SNAPSHOT.jar. </P>
<DIV></DIV>
<P>Intentando descargar geronimo-test-ddbean-1.0-SNAPSHOT.jar. </P>
<DIV></DIV>
<P>Intentando descargar geronimo-naming-1.0-SNAPSHOT.jar. </P>
<DIV></DIV>
<P>Intentando descargar geronimo-naming-builder-1.0-SNAPSHOT.jar. </P>
<DIV></DIV>
<P>Intentando descargar geronimo-spring-1.0-SNAPSHOT.jar. </P>
<DIV></DIV>
<P>Intentando descargar geronimo-j2ee-1.0-SNAPSHOT.jar. </P>
<DIV></DIV>
<P>Intentando descargar geronimo-j2ee-builder-1.0-SNAPSHOT.jar. </P>
<DIV></DIV>
<P>Intentando descargar geronimo-security-1.0-SNAPSHOT.jar. </P>
<DIV></DIV>
<P>Intentando descargar geronimo-security-builder-1.0-SNAPSHOT.jar. </P>
<DIV></DIV>
<P>Intentando descargar geronimo-service-builder-1.0-SNAPSHOT.jar. </P>
<DIV></DIV>
<P>Intentando descargar geronimo-transaction-1.0-SNAPSHOT.jar. </P>
<DIV></DIV>
<P>Intentando descargar geronimo-connector-1.0-SNAPSHOT.jar. </P>
<DIV></DIV>
<P>Intentando descargar geronimo-common-1.0-SNAPSHOT.jar. </P>
<DIV></DIV>
<P>Intentando descargar geronimo-system-1.0-SNAPSHOT.jar. </P>
<DIV></DIV>
<P>Intentando descargar geronimo-j2ee-schema-1.0-SNAPSHOT.jar. </P>
<DIV></DIV>
<P>Intentando descargar tranql-1.0-SNAPSHOT.jar. </P>
<DIV></DIV>
<DIV></DIV>
<P>jar:install: </P>
<DIV></DIV>
<DIV></DIV>
<DIV></DIV>
<P>build:end: </P>
<DIV></DIV>
<DIV></DIV>
<P>build:start: </P>
<DIV></DIV>
<DIV></DIV>
<P>default: </P>
<DIV></DIV>
<P>java:prepare-filesystem: </P>
<DIV></DIV>
<P>&nbsp;&nbsp;&nbsp;&nbsp;[mkdir] Created dir: C:\geronimo\modules\spring-builder\target\classes
</P>
<DIV></DIV>
<DIV></DIV>
<P>java:compile: </P>
<DIV></DIV>
<P>&nbsp;&nbsp;&nbsp;&nbsp;[depend] Deleted 0 out of date files in 0
seconds </P>
<DIV></DIV>
<P>&nbsp;&nbsp;&nbsp;&nbsp;[echo] Compiling to C:\geronimo\modules\spring-builder/target/classes
</P>
<DIV></DIV>
<P>&nbsp;&nbsp;&nbsp;&nbsp;[javac] Compiling 4 source files to C:\geronimo\modules\spring-builder\targe
</P>
<DIV></DIV>
<P>t\classes </P>
<DIV></DIV>
<DIV></DIV>
<P>java:jar-resources: </P>
<DIV></DIV>
<DIV></DIV>
<P>test:prepare-filesystem: </P>
<DIV></DIV>
<P>&nbsp;&nbsp;&nbsp;&nbsp;[mkdir] Created dir: C:\geronimo\modules\spring-builder\target\test-classes
</P>
<DIV></DIV>
<P>&nbsp;&nbsp;&nbsp;&nbsp;[mkdir] Created dir: C:\geronimo\modules\spring-builder\target\test-reports
</P>
<DIV></DIV>
<DIV></DIV>
<P>test:test-resources: </P>
<DIV></DIV>
<DIV></DIV>
<P>test:compile: </P>
<DIV></DIV>
<P>&nbsp;&nbsp;&nbsp;&nbsp;[echo] No test source files to compile. </P>
<DIV></DIV>
<DIV></DIV>
<P>test:test: </P>
<DIV></DIV>
<P>&nbsp;&nbsp;&nbsp;&nbsp;[echo] No tests to run. </P>
<DIV></DIV>
<P>&nbsp;&nbsp;&nbsp;&nbsp;[touch] Creating C:\geronimo\modules\spring-builder\target\test-reports\tsta
</P>
<DIV></DIV>
<P>mp </P>
<DIV></DIV>
<DIV></DIV>
<P>jar:jar: </P>
<DIV></DIV>
<P>&nbsp;&nbsp;&nbsp;&nbsp;[jar] Building jar: C:\geronimo\modules\spring-builder\target\geronimo-sprin
</P>
<DIV></DIV>
<P>g-builder-1.0-SNAPSHOT.jar </P>
<DIV></DIV>
<P>Copying: from 'C:\geronimo\modules\spring-builder\target\geronimo-spring-builder
</P>
<DIV></DIV>
<P>-1.0-SNAPSHOT.jar' to: 'C:\Documents and Settings\Katia\.maven\repository\geroni
</P>
<DIV></DIV>
<P>mo\jars\geronimo-spring-builder-1.0-SNAPSHOT.jar' </P>
<DIV></DIV>
<P>Copying: from 'C:\geronimo\modules\spring-builder\project.xml' to: 'C:\Documents
</P>
<DIV></DIV>
<P>and Settings\Katia\.maven\repository\geronimo\poms\geronimo-spring-builder-1.0- </P>
<DIV></DIV>
<P>SNAPSHOT.pom' </P>
<DIV></DIV>
<P>+---------------------------------------- </P>
<DIV></DIV>
<P>| Executing default Geronimo :: Assembly </P>
<DIV></DIV>
<P>| Memory: 78M/86M </P>
<DIV></DIV>
<P>+---------------------------------------- </P>
<DIV></DIV>
<P>Intentando descargar geronimo-deployment-plugin-1.0-SNAPSHOT.jar. </P>
<DIV></DIV>
<P>Intentando descargar geronimo-activation-1.0-SNAPSHOT.jar. </P>
<DIV></DIV>
<P>Intentando descargar geronimo-client-1.0-SNAPSHOT.jar. </P>
<DIV></DIV>
<P>Intentando descargar geronimo-client-builder-1.0-SNAPSHOT.jar. </P>
<DIV></DIV>
<P>Intentando descargar geronimo-clustering-1.0-SNAPSHOT.jar. </P>
<DIV></DIV>
<P>Intentando descargar geronimo-common-1.0-SNAPSHOT.jar. </P>
<DIV></DIV>
<P>Intentando descargar geronimo-connector-1.0-SNAPSHOT.jar. </P>
<DIV></DIV>
<P>Intentando descargar geronimo-connector-builder-1.0-SNAPSHOT.jar. </P>
<DIV></DIV>
<P>Intentando descargar geronimo-core-1.0-SNAPSHOT.jar. </P>
<DIV></DIV>
<P>Intentando descargar geronimo-deployment-1.0-SNAPSHOT.jar. </P>
<DIV></DIV>
<P>Intentando descargar geronimo-deploy-tool-1.0-SNAPSHOT.jar. </P>
<DIV></DIV>
<P>Intentando descargar geronimo-j2ee-1.0-SNAPSHOT.jar. </P>
<DIV></DIV>
<P>Intentando descargar geronimo-j2ee-builder-1.0-SNAPSHOT.jar. </P>
<DIV></DIV>
<P>Intentando descargar geronimo-jetty-1.0-SNAPSHOT.jar. </P>
<DIV></DIV>
<P>Intentando descargar geronimo-jetty-builder-1.0-SNAPSHOT.jar. </P>
<DIV></DIV>
<P>Intentando descargar geronimo-jmxremoting-1.0-SNAPSHOT.jar. </P>
<DIV></DIV>
<P>Intentando descargar geronimo-kernel-1.0-SNAPSHOT.jar. </P>
<DIV></DIV>
<P>Intentando descargar geronimo-naming-1.0-SNAPSHOT.jar. </P>
<DIV></DIV>
<P>Intentando descargar geronimo-naming-builder-1.0-SNAPSHOT.jar. </P>
<DIV></DIV>
<P>Intentando descargar geronimo-webservices-1.0-SNAPSHOT.jar. </P>
<DIV></DIV>
<P>Intentando descargar activeio-1.0-SNAPSHOT.jar. </P>
<DIV></DIV>
<P>Intentando descargar geronimo-security-1.0-SNAPSHOT.jar. </P>
<DIV></DIV>
<P>Intentando descargar geronimo-security-builder-1.0-SNAPSHOT.jar. </P>
<DIV></DIV>
<P>Intentando descargar geronimo-derby-1.0-SNAPSHOT.jar. </P>
<DIV></DIV>
<P>Intentando descargar geronimo-derby-connector-1.0-SNAPSHOT.rar. </P>
<DIV></DIV>
<P>Intentando descargar geronimo-service-builder-1.0-SNAPSHOT.jar. </P>
<DIV></DIV>
<P>Intentando descargar geronimo-system-1.0-SNAPSHOT.jar. </P>
<DIV></DIV>
<P>Intentando descargar geronimo-timer-1.0-SNAPSHOT.jar. </P>
<DIV></DIV>
<P>Intentando descargar geronimo-transaction-1.0-SNAPSHOT.jar. </P>
<DIV></DIV>
<P>Intentando descargar geronimo-j2ee-schema-1.0-SNAPSHOT.jar. </P>
<DIV></DIV>
<P>Intentando descargar geronimo-classloader-server-1.0-SNAPSHOT.jar. </P>
<DIV></DIV>
<P>Intentando descargar tranql-connector-1.0-SNAPSHOT.rar. </P>
<DIV></DIV>
<P>Intentando descargar activemq-core-3.0-SNAPSHOT.jar. </P>
<DIV></DIV>
<P>Intentando descargar activemq-gbean-3.0-SNAPSHOT.jar. </P>
<DIV></DIV>
<P>Intentando descargar activemq-ra-3.0-SNAPSHOT.rar. </P>
<DIV></DIV>
<P>Intentando descargar openejb-core-2.0-SNAPSHOT.jar. </P>
<DIV></DIV>
<P>Intentando descargar openejb-builder-2.0-SNAPSHOT.jar. </P>
<DIV></DIV>
<P>Intentando descargar tranql-1.0-SNAPSHOT.jar. </P>
<DIV></DIV>
<P>Intentando descargar org.mortbay.jetty-5.1.3-G-SNAPSHOT.jar. </P>
<DIV></DIV>
<P>Intentando descargar geronimo-tomcat-1.0-SNAPSHOT.jar. </P>
<DIV></DIV>
<P>Intentando descargar jasper-compiler-jdt-5.5.7.jar. </P>
<DIV></DIV>
<P>897K downloaded </P>
<DIV></DIV>
<P>Intentando descargar geronimo-demo-1.0-SNAPSHOT.war. </P>
<DIV></DIV>
<P>Intentando descargar geronimo-jmxdebug-1.0-SNAPSHOT.war. </P>
<DIV></DIV>
<P>Intentando descargar geronimo-mail-1.0-SNAPSHOT.jar. </P>
<DIV></DIV>
<P>Intentando descargar geronimo-spec-activation-1.0.2-SNAPSHOT.jar. </P>
<DIV></DIV>
<P>Intentando descargar geronimo-spec-javamail-1.3.1-SNAPSHOT.jar. </P>
<DIV></DIV>
<P>Intentando descargar geronimo-axis-1.0-SNAPSHOT.jar. </P>
<DIV></DIV>
<P>Intentando descargar geronimo-axis-builder-1.0-SNAPSHOT.jar. </P>
<DIV></DIV>
<P>Intentando descargar commons-discovery-SNAPSHOT.jar. </P>
<DIV></DIV>
<P>Intentando descargar ews-SNAPSHOT.jar. </P>
<DIV></DIV>
<P>Intentando descargar tmporb-orb-1.0-SNAPSHOT.jar. </P>
<DIV></DIV>
<P>Intentando descargar tmporb-orb-omg-1.0-SNAPSHOT.jar. </P>
<DIV></DIV>
<P>Intentando descargar tmporb-orb-tools-1.0-SNAPSHOT.jar. </P>
<DIV></DIV>
<P>Intentando descargar tmporb-tools-1.0-SNAPSHOT.jar. </P>
<DIV></DIV>
<P>Intentando descargar tmporb-ins-1.0-SNAPSHOT.jar. </P>
<DIV></DIV>
<P>Intentando descargar tmporb-pss-1.0-SNAPSHOT.jar. </P>
<DIV></DIV>
<P>Intentando descargar tmporb-ots-1.0-SNAPSHOT.jar. </P>
<DIV></DIV>
<P>Intentando descargar geronimo-spring-1.0-SNAPSHOT.jar. </P>
<DIV></DIV>
<P>Intentando descargar geronimo-spring-builder-1.0-SNAPSHOT.jar. </P>
<DIV></DIV>
<P>Intentando descargar jaxr-api-1.0-SNAPSHOT.jar. </P>
<DIV></DIV>
<P>Intentando descargar scout-1.0-SNAPSHOT.jar. </P>
<DIV></DIV>
<P>Intentando descargar juddi-SNAPSHOT.jar. </P>
<DIV></DIV>
<P>Intentando descargar geronimo-common-1.0-SNAPSHOT.jar. </P>
<DIV></DIV>
<P>Intentando descargar geronimo-kernel-1.0-SNAPSHOT.jar. </P>
<DIV></DIV>
<P>Intentando descargar geronimo-deployment-1.0-SNAPSHOT.jar. </P>
<DIV></DIV>
<P>Intentando descargar geronimo-deploy-tool-1.0-SNAPSHOT.jar. </P>
<DIV></DIV>
<P>Intentando descargar geronimo-system-1.0-SNAPSHOT.jar. </P>
<DIV></DIV>
<DIV></DIV>
<P>BUILD FAILED </P>
<DIV></DIV>
<P>File...... C:\Documents and Settings\Katia\.maven\cache\maven-multiproject-plugi
</P>
<DIV></DIV>
<P>n-1.3.1\plugin.jelly </P>
<DIV></DIV>
<P>Element... maven:reactor </P>
<DIV></DIV>
<P>Line...... 217 </P>
<DIV></DIV>
<P>Column.... 9 </P>
<DIV></DIV>
<P>Unable to obtain goal [default] -- C:\Documents and Settings\Katia\.maven\cache\
</P>
<DIV></DIV>
<P>maven-java-plugin-1.4\plugin.jelly:33:43: <ant:mkdir>Directory C:\geronimo\modu
</P>
<DIV></DIV>
<P>les\assembly\target\classes creation was not successful for an unknown reason </P>
<DIV></DIV>
<P>Total time: 26 minutes 50 seconds </P>
<DIV></DIV>
<P>Finished at: Fri Apr 01 02:48:40 CEST 2005 </P>
<DIV></DIV>
<DIV></DIV>
<P>C:\geronimo&gt;</ant:mkdir><BR><BR></P></DIV>
<DIV></DIV>&gt;From: Jacek Laskowski &lt;jlaskowski@apache.org&gt;
<DIV></DIV>&gt;Reply-To: dev@geronimo.apache.org
<DIV></DIV>&gt;To: dev@geronimo.apache.org
<DIV></DIV>&gt;Subject: Re: Build fail
<DIV></DIV>&gt;Date: Thu, 31 Mar 2005 23:52:26 +0200
<DIV></DIV>&gt;
<DIV></DIV>&gt;Katia Aresti Gonzalez wrote:
<DIV></DIV>&gt;
<DIV></DIV>&gt;&gt;&nbsp;&nbsp;&nbsp;&nbsp; [copy] Copying
1 file to
<DIV></DIV>&gt;&gt;C:\geronimo\modules\tomcat\target\endorsed
<DIV></DIV>&gt;&gt;&nbsp;&nbsp;&nbsp;&nbsp; [copy] Copying
1 file to
<DIV></DIV>&gt;&gt;C:\geronimo\modules\tomcat\target\endorsed
<DIV></DIV>&gt;&gt;&nbsp;&nbsp;&nbsp;&nbsp; [junit] Running
org.apache.geronimo.tomcat.ApplicationTest
<DIV></DIV>&gt;&gt;&nbsp;&nbsp;&nbsp;&nbsp; [junit] Tests
run: 2, Failures: 0, Errors: 2, Time elapsed:
<DIV></DIV>&gt;&gt;3,406 sec
<DIV></DIV>&gt;&gt;&nbsp;&nbsp;&nbsp;&nbsp; [junit] [ERROR]
TEST
<DIV></DIV>&gt;&gt;org.apache.geronimo.tomcat.ApplicationTest FAILED
<DIV></DIV>&gt;&gt;&nbsp;&nbsp;&nbsp;&nbsp; [junit] Running
org.apache.geronimo.tomcat.JAASSecurityTest
<DIV></DIV>&gt;&gt;&nbsp;&nbsp;&nbsp;&nbsp; [junit] Tests
run: 4, Failures: 0, Errors: 4, Time elapsed:
<DIV></DIV>&gt;&gt;2,484 sec
<DIV></DIV>&gt;&gt;&nbsp;&nbsp;&nbsp;&nbsp; [junit] [ERROR]
TEST
<DIV></DIV>&gt;&gt;org.apache.geronimo.tomcat.JAASSecurityTest FAILED
<DIV></DIV>&gt;&gt;&nbsp;&nbsp;&nbsp;&nbsp; [junit] Running
org.apache.geronimo.tomcat.JACCSecurityTest
<DIV></DIV>&gt;&gt;&nbsp;&nbsp;&nbsp;&nbsp; [junit] Tests
run: 2, Failures: 0, Errors: 2, Time elapsed:
<DIV></DIV>&gt;&gt;2,344 sec
<DIV></DIV>&gt;&gt;&nbsp;&nbsp;&nbsp;&nbsp; [junit] [ERROR]
TEST
<DIV></DIV>&gt;&gt;org.apache.geronimo.tomcat.JACCSecurityTest FAILED
<DIV></DIV>&gt;&gt;BUILD FAILED
<DIV></DIV>&gt;
<DIV></DIV>&gt;Hi,
<DIV></DIV>&gt;
<DIV></DIV>&gt;Would you tell us about your build environment? What's the
JDK
<DIV></DIV>&gt;version? What's in
<DIV></DIV>&gt;C:\geronimo\modules\tomcat\target\test-reports\TEST-org.apache.geronimo.tomcat.ApplicationTest.txt
<DIV></DIV>&gt;and the rest of the failed tests reports?
<DIV></DIV>&gt;
<DIV></DIV>&gt;Please make sure that you're building the latest sources as
there
<DIV></DIV>&gt;was a change in the tomcat module that influences the build.
<DIV></DIV>&gt;
<DIV></DIV>&gt;Jacek
<DIV></DIV>&gt;
<DIV></DIV></div><br clear=all><hr>Recibe ofertas de empleo
adaptadas a tu perfil. <a href="http://g.msn.com/8HMBESES/2752??PS=47575" target="_top">Introduce
tu CV en MSN Empleo.</a> </html>


Mime
View raw message