geronimo-dev mailing list archives

Site index · List index
Message view « Date » · « Thread »
Top « Date » · « Thread »
From "Katia Aresti Gonzalez" <kaare...@hotmail.com>
Subject Build fail
Date Thu, 31 Mar 2005 18:12:51 GMT
<html><div style='background-color:'><DIV class=RTE><STRONG>hi!!!</STRONG></DIV>
<DIV class=RTE><STRONG></STRONG>&nbsp;</DIV>
<DIV class=RTE><STRONG>Anybody can help?? build failure</STRONG></DIV>
<DIV class=RTE>&nbsp;</DIV>
<DIV class=RTE>after doing clean, maven command... BUILD FAIL :-(</DIV>
<DIV class=RTE>&nbsp;</DIV>
<DIV class=RTE>test:compile:<BR>&nbsp;&nbsp;&nbsp; [javac] Compiling
1 source file to C:\geronimo\modules\derby\target\test-cla<BR>sses</DIV>
<DIV class=RTE>test:test:<BR>&nbsp;&nbsp;&nbsp; [junit] Running org.apache.geronimo.derby.DerbySystemGBeanTest<BR>&nbsp;&nbsp;&nbsp;
[junit] Tests run: 1, Failures: 0, Errors: 0, Time elapsed: 6,875 sec<BR>&nbsp;&nbsp;&nbsp;
[touch] Creating C:\geronimo\modules\derby\target\test-reports\tstamp</DIV>
<DIV class=RTE>jar:jar:<BR>&nbsp;&nbsp;&nbsp; [jar] Building jar:
C:\geronimo\modules\derby\target\geronimo-derby-1.0-SNAP<BR>SHOT.jar<BR>Copying:
from 'C:\geronimo\modules\derby\target\geronimo-derby-1.0-SNAPSHOT.jar'<BR>&nbsp;to:
'C:\Documents and Settings\Katia\.maven\repository\geronimo\jars\geronimo-d<BR>erby-1.0-SNAPSHOT.jar'<BR>Copying:
from 'C:\geronimo\modules\derby\project.xml' to: 'C:\Documents and Sett<BR>ings\Katia\.maven\repository\geronimo\poms\geronimo-derby-1.0-SNAPSHOT.pom'<BR>+----------------------------------------<BR>|
Executing default Geronimo :: Derby :: Connector<BR>| Memory: 68M/73M<BR>+----------------------------------------<BR>Intentando
descargar tranql-connector-1.0-SNAPSHOT.jar.</DIV>
<DIV class=RTE>jar:install:</DIV>
<DIV class=RTE><BR>build:end:</DIV>
<DIV class=RTE>build:start:</DIV>
<DIV class=RTE>default:<BR>rar:init:<BR>&nbsp;&nbsp;&nbsp; [mkdir]
Created dir: C:\geronimo\modules\derby-connector\target</DIV>
<DIV class=RTE>rar:rar:<BR>java:prepare-filesystem:<BR>&nbsp;&nbsp;&nbsp;
[mkdir] Created dir: C:\geronimo\modules\derby-connector\target\classes</DIV>
<DIV class=RTE>java:compile:<BR>&nbsp;&nbsp;&nbsp; [depend] Deleted
0 out of date files in 0 seconds<BR>&nbsp;&nbsp;&nbsp; [echo] Compiling
to C:\geronimo\modules\derby-connector/target/classes<BR>&nbsp;&nbsp;&nbsp;
[javac] Compiling 1 source file to C:\geronimo\modules\derby-connector\targe<BR>t\classes</DIV>
<DIV class=RTE>java:jar-resources:</DIV>
<DIV class=RTE>test:prepare-filesystem:<BR>&nbsp;&nbsp;&nbsp; [mkdir]
Created dir: C:\geronimo\modules\derby-connector\target\test-classes</DIV>
<DIV class=RTE>&nbsp;&nbsp;&nbsp; [mkdir] Created dir: C:\geronimo\modules\derby-connector\target\test-reports</DIV>
<DIV class=RTE><BR>test:test-resources:</DIV>
<DIV class=RTE>test:compile:<BR>&nbsp;&nbsp;&nbsp; [echo] No test
source files to compile.</DIV>
<DIV class=RTE>test:test:<BR>&nbsp;&nbsp;&nbsp; [echo] No tests to
run.<BR>&nbsp;&nbsp;&nbsp; [touch] Creating C:\geronimo\modules\derby-connector\target\test-reports\tst<BR>amp</DIV>
<DIV class=RTE>jar:jar:<BR>&nbsp;&nbsp;&nbsp; [jar] Building jar:
C:\geronimo\modules\derby-connector\target\geronimo-derb<BR>y-connector-1.0-SNAPSHOT.jar<BR>Copying:
from 'C:\geronimo\modules\derby-connector\target\geronimo-derby-connect<BR>or-1.0-SNAPSHOT.jar'
to: 'C:\Documents and Settings\Katia\.maven\repository\gero<BR>nimo\jars\geronimo-derby-connector-1.0-SNAPSHOT.jar'<BR>Copying:
from 'C:\geronimo\modules\derby-connector\project.xml' to: 'C:\Document<BR>s and Settings\Katia\.maven\repository\geronimo\poms\geronimo-derby-connector-1.<BR>0-SNAPSHOT.pom'</DIV>
<DIV class=RTE>jar:install:</DIV>
<DIV class=RTE>&nbsp;&nbsp;&nbsp; [echo] Building rar geronimo-derby-connector-1.0-SNAPSHOT
with ra.xml "C:\ge<BR>ronimo\modules\derby-connector/src/rar/META-INF/ra.xml"<BR>&nbsp;&nbsp;&nbsp;
[echo] trying to include C:\geronimo\modules\derby-connector/target/geronimo<BR>-derby-connector-1.0-SNAPSHOT.jar<BR>&nbsp;&nbsp;&nbsp;
[echo] Bundling: jar - tranql:tranql-connector<BR>&nbsp;&nbsp;&nbsp; [mkdir]
Created dir: C:\geronimo\modules\derby-connector\target\rar<BR>&nbsp;&nbsp;&nbsp;
[jar] Building jar: C:\geronimo\modules\derby-connector\target\geronimo-derb<BR>y-connector-1.0-SNAPSHOT.rar<BR>Copying:
from 'C:\geronimo\modules\derby-connector\target\geronimo-derby-connect<BR>or-1.0-SNAPSHOT.rar'
to: 'C:\Documents and Settings\Katia\.maven\repository\gero<BR>nimo\rars\geronimo-derby-connector-1.0-SNAPSHOT.rar'<BR>Copying:
from 'C:\geronimo\modules\derby-connector\project.xml' to: 
'C:\Document<BR>s and Settings\Katia\.maven\repository\geronimo\poms\geronimo-derby-connector-1.<BR>0-SNAPSHOT.pom'<BR>+----------------------------------------<BR>|
Executing default Geronimo :: Timer<BR>| Memory: 48M/85M<BR>+----------------------------------------<BR>Intentando
descargar geronimo-connector-1.0-SNAPSHOT.jar.<BR>Intentando descargar geronimo-core-1.0-SNAPSHOT.jar.<BR>Intentando
descargar geronimo-j2ee-1.0-SNAPSHOT.jar.<BR>Intentando descargar geronimo-kernel-1.0-SNAPSHOT.jar.<BR>Intentando
descargar geronimo-transaction-1.0-SNAPSHOT.jar.<BR>Intentando descargar tranql-1.0-SNAPSHOT.jar.</DIV>
<DIV class=RTE>rar:install:</DIV>
<DIV class=RTE><BR>build:end:</DIV>
<DIV class=RTE>build:start:</DIV>
<DIV class=RTE>default:<BR>java:prepare-filesystem:<BR>&nbsp;&nbsp;&nbsp;
[mkdir] Created dir: C:\geronimo\modules\timer\target\classes</DIV>
<DIV class=RTE>java:compile:<BR>&nbsp;&nbsp;&nbsp; [depend] Deleted
0 out of date files in 0 seconds<BR>&nbsp;&nbsp;&nbsp; [echo] Compiling
to C:\geronimo\modules\timer/target/classes<BR>&nbsp;&nbsp;&nbsp; [javac]
Compiling 20 source files to C:\geronimo\modules\timer\target\classe<BR>s</DIV>
<DIV class=RTE>java:jar-resources:</DIV>
<DIV class=RTE>test:prepare-filesystem:<BR>&nbsp;&nbsp;&nbsp; [mkdir]
Created dir: C:\geronimo\modules\timer\target\test-classes<BR>&nbsp;&nbsp;&nbsp;
[mkdir] Created dir: C:\geronimo\modules\timer\target\test-reports</DIV>
<DIV class=RTE>test:test-resources:</DIV>
<DIV class=RTE>test:compile:<BR>&nbsp;&nbsp;&nbsp; [javac] Compiling
6 source files to C:\geronimo\modules\timer\target\test-cl<BR>asses</DIV>
<DIV class=RTE>test:test:<BR>&nbsp;&nbsp;&nbsp; [junit] Running org.apache.geronimo.timer.jdbc.AxionJDBCWorkerPersistenceTes<BR>t<BR>&nbsp;&nbsp;&nbsp;
[junit] Tests run: 3, Failures: 0, Errors: 0, Time elapsed: 1,578 sec<BR>&nbsp;&nbsp;&nbsp;
[junit] Running org.apache.geronimo.timer.jdbc.DerbyJDBCWorkerPersistenceTes<BR>t<BR>&nbsp;&nbsp;&nbsp;
[junit] Tests run: 3, Failures: 0, Errors: 0, Time elapsed: 32,188 sec<BR>&nbsp;&nbsp;&nbsp;
[junit] Running org.apache.geronimo.timer.TransactionalThreadPooledTimerTest</DIV>
<DIV class=RTE>&nbsp;&nbsp;&nbsp; [junit] Tests run: 10, Failures: 0, Errors:
0, Time elapsed: 25,297 sec<BR>&nbsp;&nbsp;&nbsp; [junit] Running org.apache.geronimo.timer.NontransactionalThreadPooledTimerT<BR>est<BR>&nbsp;&nbsp;&nbsp;
[junit] Tests run: 10, Failures: 0, Errors: 0, Time elapsed: 25,297 sec<BR>&nbsp;&nbsp;&nbsp;
[touch] Creating C:\geronimo\modules\timer\target\test-reports\tstamp</DIV>
<DIV class=RTE>jar:jar:<BR>&nbsp;&nbsp;&nbsp; [jar] Building jar:
C:\geronimo\modules\timer\target\geronimo-timer-1.0-SNAP<BR>SHOT.jar<BR>Copying:
from 'C:\geronimo\modules\timer\target\geronimo-timer-1.0-SNAPSHOT.jar'<BR>&nbsp;to:
'C:\Documents and Settings\Katia\.maven\repository\geronimo\jars\geronimo-t<BR>imer-1.0-SNAPSHOT.jar'<BR>Copying:
from 'C:\geronimo\modules\timer\project.xml' to: 'C:\Documents and Sett<BR>ings\Katia\.maven\repository\geronimo\poms\geronimo-timer-1.0-SNAPSHOT.pom'<BR>+----------------------------------------<BR>|
Executing default Geronimo :: ClassLoader Server<BR>| Memory: 48M/85M<BR>+----------------------------------------<BR>Intentando
descargar geronimo-kernel-1.0-SNAPSHOT.jar.<BR>Artifact /geronimo/jars/geronimo-kernel-1.0-SNAPSHOT.jar
doesn't exists in remot<BR>e repository, but it exists locally<BR>Intentando descargar

geronimo-j2ee-1.0-SNAPSHOT.jar.<BR>Artifact /geronimo/jars/geronimo-j2ee-1.0-SNAPSHOT.jar
doesn't exists in remote<BR>repository, but it exists locally<BR>Intentando descargar
geronimo-webservices-1.0-SNAPSHOT.jar.<BR>Artifact /geronimo/jars/geronimo-webservices-1.0-SNAPSHOT.jar
doesn't exists in<BR>remote repository, but it exists locally<BR>Intentando descargar
geronimo-jetty-1.0-SNAPSHOT.jar.<BR>Artifact /geronimo/jars/geronimo-jetty-1.0-SNAPSHOT.jar
doesn't exists in remote<BR>&nbsp;repository, but it exists locally<BR>Intentando
descargar org.mortbay.jetty-5.1.3-G-SNAPSHOT.jar.<BR>Artifact /jetty/jars/org.mortbay.jetty-5.1.3-G-SNAPSHOT.jar
doesn't exists in re<BR>mote repository, but it exists locally</DIV>
<DIV class=RTE>jar:install:</DIV>
<DIV class=RTE><BR>build:end:</DIV>
<DIV class=RTE>build:start:</DIV>
<DIV class=RTE>default:<BR>java:prepare-filesystem:<BR>&nbsp;&nbsp;&nbsp;
[mkdir] Created dir: C:\geronimo\modules\classloader-server\target\classes</DIV>
<DIV class=RTE>java:compile:<BR>&nbsp;&nbsp;&nbsp; [depend] Deleted
0 out of date files in 0 seconds<BR>&nbsp;&nbsp;&nbsp; [echo] Compiling
to C:\geronimo\modules\classloader-server/target/classes<BR>&nbsp;&nbsp;&nbsp;
[javac] Compiling 5 source files to C:\geronimo\modules\classloader-server\t<BR>arget\classes</DIV>
<DIV class=RTE>java:jar-resources:</DIV>
<DIV class=RTE>test:prepare-filesystem:<BR>&nbsp;&nbsp;&nbsp; [mkdir]
Created dir: C:\geronimo\modules\classloader-server\target\test-clas<BR>ses<BR>&nbsp;&nbsp;&nbsp;
[mkdir] Created dir: C:\geronimo\modules\classloader-server\target\test-repo<BR>rts</DIV>
<DIV class=RTE>test:test-resources:</DIV>
<DIV class=RTE>test:compile:<BR>&nbsp;&nbsp;&nbsp; [javac] Compiling
1 source file to C:\geronimo\modules\classloader-server\ta<BR>rget\test-classes</DIV>
<DIV class=RTE>test:test:<BR>&nbsp;&nbsp;&nbsp; [junit] Running org.apache.geronimo.classloaderserver.http.HTTPClassLoaderSe<BR>rverTest<BR>&nbsp;&nbsp;&nbsp;
[junit] Tests run: 3, Failures: 0, Errors: 0, Time elapsed: 6,656 sec<BR>&nbsp;&nbsp;&nbsp;
[touch] Creating C:\geronimo\modules\classloader-server\target\test-reports\<BR>tstamp</DIV>
<DIV class=RTE>jar:jar:<BR>&nbsp;&nbsp;&nbsp; [jar] Building jar:
C:\geronimo\modules\classloader-server\target\geronimo-c<BR>lassloader-server-1.0-SNAPSHOT.jar<BR>Copying:
from 'C:\geronimo\modules\classloader-server\target\geronimo-classloade<BR>r-server-1.0-SNAPSHOT.jar'
to: 'C:\Documents and Settings\Katia\.maven\repositor<BR>y\geronimo\jars\geronimo-classloader-server-1.0-SNAPSHOT.jar'<BR>Copying:
from 'C:\geronimo\modules\classloader-server\project.xml' to: 'C:\Docum<BR>ents and
Settings\Katia\.maven\repository\geronimo\poms\geronimo-classloader-ser<BR>ver-1.0-SNAPSHOT.pom'<BR>+----------------------------------------<BR>|
Executing default Geronimo :: Tomcat<BR>| Memory: 48M/89M<BR>+----------------------------------------<BR>Intentando
descargar geronimo-jetty-builder-1.0-SNAPSHOT.jar.<BR>Intentando descargar geronimo-common-1.0-SNAPSHOT.jar.<BR>Intentando
descargar 
geronimo-connector-1.0-SNAPSHOT.jar.<BR>Intentando descargar geronimo-deployment-1.0-SNAPSHOT.jar.<BR>Intentando
descargar geronimo-j2ee-builder-1.0-SNAPSHOT.jar.<BR>Intentando descargar geronimo-kernel-1.0-SNAPSHOT.jar.<BR>Intentando
descargar geronimo-naming-1.0-SNAPSHOT.jar.<BR>Intentando descargar geronimo-naming-builder-1.0-SNAPSHOT.jar.<BR>Intentando
descargar geronimo-security-1.0-SNAPSHOT.jar.<BR>Intentando descargar geronimo-system-1.0-SNAPSHOT.jar.<BR>Intentando
descargar geronimo-transaction-1.0-SNAPSHOT.jar.<BR>Intentando descargar geronimo-j2ee-1.0-SNAPSHOT.jar.<BR>Intentando
descargar geronimo-j2ee-schema-1.0-SNAPSHOT.jar.</DIV>
<DIV class=RTE>jar:install:</DIV>
<DIV class=RTE><BR>build:end:</DIV>
<DIV class=RTE>build:start:</DIV>
<DIV class=RTE>default:<BR>build:<BR>java:prepare-filesystem:<BR>&nbsp;&nbsp;&nbsp;
[mkdir] Created dir: C:\geronimo\modules\tomcat\target\classes</DIV>
<DIV class=RTE>java:compile:<BR>&nbsp;&nbsp;&nbsp; [depend] Deleted
0 out of date files in 0 seconds<BR>&nbsp;&nbsp;&nbsp; [echo] Compiling
to C:\geronimo\modules\tomcat/target/classes<BR>&nbsp;&nbsp;&nbsp; [javac]
Compiling 11 source files to C:\geronimo\modules\tomcat\target\class<BR>es</DIV>
<DIV class=RTE>java:jar-resources:</DIV>
<DIV class=RTE>test:prepare-filesystem:<BR>&nbsp;&nbsp;&nbsp; [mkdir]
Created dir: C:\geronimo\modules\tomcat\target\test-classes<BR>&nbsp;&nbsp;&nbsp;
[mkdir] Created dir: C:\geronimo\modules\tomcat\target\test-reports</DIV>
<DIV class=RTE>test:test-resources:</DIV>
<DIV class=RTE>test:compile:<BR>&nbsp;&nbsp;&nbsp; [javac] Compiling
4 source files to C:\geronimo\modules\tomcat\target\test-c<BR>lasses</DIV>
<DIV class=RTE>test:test:<BR>&nbsp;&nbsp;&nbsp; [mkdir] Created dir:
C:\geronimo\modules\tomcat\target\endorsed<BR>&nbsp;&nbsp;&nbsp; [mkdir]
Created dir: C:\geronimo\modules\tomcat\target\var<BR>&nbsp;&nbsp;&nbsp;
[mkdir] Created dir: C:\geronimo\modules\tomcat\target\var\catalina<BR>&nbsp;&nbsp;&nbsp;
[mkdir] Created dir: C:\geronimo\modules\tomcat\target\var\catalina\webapps<BR>&nbsp;&nbsp;&nbsp;
[mkdir] Created dir: C:\geronimo\modules\tomcat\target\var\catalina\conf<BR>&nbsp;&nbsp;&nbsp;
[copy] Copying 1 file to C:\geronimo\modules\tomcat\target\var\catalina\conf</DIV>
<DIV class=RTE>&nbsp;&nbsp;&nbsp; [copy] Copying 8 files to C:\geronimo\modules\tomcat\target\var\catalina\web<BR>apps<BR>&nbsp;&nbsp;&nbsp;
[copy] Copying 1 file to C:\geronimo\modules\tomcat\target\endorsed<BR>&nbsp;&nbsp;&nbsp;
[copy] Copying 1 file to C:\geronimo\modules\tomcat\target\endorsed<BR>&nbsp;&nbsp;&nbsp;
[junit] Running org.apache.geronimo.tomcat.ApplicationTest<BR>&nbsp;&nbsp;&nbsp;
[junit] Tests run: 2, Failures: 0, Errors: 2, Time elapsed: 3,406 sec<BR>&nbsp;&nbsp;&nbsp;
[junit] [ERROR] TEST org.apache.geronimo.tomcat.ApplicationTest FAILED<BR>&nbsp;&nbsp;&nbsp;
[junit] Running org.apache.geronimo.tomcat.JAASSecurityTest<BR>&nbsp;&nbsp;&nbsp;
[junit] Tests run: 4, Failures: 0, Errors: 4, Time elapsed: 2,484 sec<BR>&nbsp;&nbsp;&nbsp;
[junit] [ERROR] TEST org.apache.geronimo.tomcat.JAASSecurityTest FAILED<BR>&nbsp;&nbsp;&nbsp;
[junit] Running 
org.apache.geronimo.tomcat.JACCSecurityTest<BR>&nbsp;&nbsp;&nbsp; [junit]
Tests run: 2, Failures: 0, Errors: 2, Time elapsed: 2,344 sec<BR>&nbsp;&nbsp;&nbsp;
[junit] [ERROR] TEST org.apache.geronimo.tomcat.JACCSecurityTest FAILED</DIV>
<DIV class=RTE>BUILD FAILED<BR>File...... C:\Documents and Settings\Katia\.maven\cache\maven-multiproject-plugi<BR>n-1.3.1\plugin.jelly<BR>Element...
maven:reactor<BR>Line...... 217<BR>Column.... 9<BR>Unable to obtain goal
[default] -- C:\Documents and Settings\Katia\.maven\cache\<BR>maven-test-plugin-1.6.2\plugin.jelly:181:54:
&lt;fail&gt; There were test failures.<BR>Total time: 23 minutes 38 seconds<BR>Finished
at: Thu Mar 31 20:09:17 CEST 2005</DIV>
<DIV class=RTE>C:\geronimo&gt;</DIV></div><br clear=all><hr>Acepta
el reto MSN Premium: incluye Antivirus y Firewall de McAffee. <a href="http://g.msn.com/8HMBESES/2731??PS=47575"
target="_top">Descárgalo y pruébalo 2 meses gratis.</a> </html>


Mime
View raw message