geronimo-dev mailing list archives

Site index · List index
Message view « Date » · « Thread »
Top « Date » · « Thread »
From Aaron Mulder <ammul...@alumni.princeton.edu>
Subject Re: build failed Mon Dec 6 09:19:33 PST 2004
Date Mon, 06 Dec 2004 15:35:40 GMT
	These failures all appear to be caused by connection timeouts.  
I'm not sure what might be causing that.  Is there a DNS problem on the 
machine or something?

Aaron

On Mon, 6 Dec 2004, i686-pc-win2k wrote:
> ==[SUMMARY]====================================
> 
>     [junit] [ERROR] TEST org.apache.geronimo.security.jaas.LoginPropertiesFileTest FAILED
>     [junit] [ERROR] TEST org.apache.geronimo.security.jaas.LoginSQLTest FAILED
>     [junit] [ERROR] TEST org.apache.geronimo.security.jaas.TimeoutTest FAILED
>     [junit] [ERROR] TEST org.apache.geronimo.security.network.protocol.SubjectCarryingProtocolTest
FAILED
>     [junit] [ERROR] TEST org.apache.geronimo.security.remoting.jmx.RemoteLoginTest FAILED
> 
> ==[UPDATED]====================================
> 
> 
> 
> 

Mime
View raw message