geronimo-dev mailing list archives

Site index · List index
Message view « Date » · « Thread »
Top « Date » · « Thread »
From "Alan D. Cabrera" <...@toolazydogs.com>
Subject RE: Security module tests are failing
Date Fri, 24 Dec 2004 11:45:32 GMT
Are you running on OSX?  Several people on OSX have reported similar
problems.


Regards,
Alan

> -----Original Message-----
> From: Craig Johannsen [mailto:cjohan@shaw.ca]
> Sent: Friday, December 24, 2004 4:25 AM
> To: dev@geronimo.apache.org
> Subject: Security module tests are failing
> 
> After running "maven m:update", I ran "maven" and got the following
test
> failures, which ran OK yesterday afternoon:
> 
> test:test:
>     [junit] Running
> org.apache.geronimo.security.remoting.jmx.RemoteLoginTest
>     [junit] Tests run: 1, Failures: 0, Errors: 0, Time elapsed: 4.141
sec
>     [junit] Running
>
org.apache.geronimo.security.network.protocol.SubjectCarryingProtocolTes
t
>     [junit] Tests run: 1, Failures: 0, Errors: 1, Time elapsed: 5.373
sec
>     [junit] [ERROR] TEST
>
org.apache.geronimo.security.network.protocol.SubjectCarryingProtocolTes
t
> FAILED
>     [junit] Running
> org.apache.geronimo.security.bridge.MappingUserPasswordBridgeTest
>     [junit] Tests run: 3, Failures: 0, Errors: 0, Time elapsed: 5.963
sec
>     [junit] Running
>
org.apache.geronimo.security.bridge.ConfiguredIdentityUserPasswordBridge
Te
> st
>     [junit] Tests run: 1, Failures: 0, Errors: 0, Time elapsed: 5.405
sec
>     [junit] Running
>
org.apache.geronimo.security.bridge.CallerIdentityUserPasswordBridgeTest
>     [junit] Tests run: 2, Failures: 0, Errors: 0, Time elapsed: 5.564
sec
>     [junit] Running
> org.apache.geronimo.security.jaas.LoginKerberosNonGeronimoTest
>     [junit] Tests run: 1, Failures: 0, Errors: 0, Time elapsed: 4.202
sec
>     [junit] Running
> org.apache.geronimo.security.jaas.LoginPropertiesFileTest
>     [junit] Tests run: 1, Failures: 0, Errors: 1, Time elapsed: 6.083
sec
>     [junit] [ERROR] TEST
> org.apache.geronimo.security.jaas.LoginPropertiesFileTest FAILED
>     [junit] Running
org.apache.geronimo.security.jaas.LoginKerberosTest
>     [junit] Tests run: 1, Failures: 0, Errors: 0, Time elapsed: 5.381
sec
>     [junit] Running org.apache.geronimo.security.jaas.LoginSQLTest
>     [junit] Tests run: 1, Failures: 0, Errors: 1, Time elapsed: 7.055
sec
>     [junit] [ERROR] TEST
org.apache.geronimo.security.jaas.LoginSQLTest
> FAILED
>     [junit] Running
> org.apache.geronimo.security.jaas.ConfigurationEntryTest
>     [junit] Tests run: 1, Failures: 0, Errors: 0, Time elapsed: 5.984
sec
>     [junit] Running org.apache.geronimo.security.jaas.TimeoutTest
>     [junit] Tests run: 1, Failures: 0, Errors: 1, Time elapsed: 6.135
sec
>     [junit] [ERROR] TEST org.apache.geronimo.security.jaas.TimeoutTest
> FAILED
>     [junit] Running
> org.apache.geronimo.security.jaas.DeploymentSupportTest
>     [junit] Tests run: 1, Failures: 0, Errors: 0, Time elapsed: 4.388
sec
>     [junit] Running
>
org.apache.geronimo.security.jacc.GeronimoPolicyConfigurationFactoryTest
>     [junit] Tests run: 2, Failures: 0, Errors: 0, Time elapsed: 1.345
sec
> 
> BUILD FAILED
> File......
> /home/craigj/.maven/cache/maven-multiproject-plugin-1.3.1/plugin.jelly
> Element... maven:reactor
> Line...... 217
> Column.... 9
> Unable to obtain goal [default] --
> /home/craigj/.maven/cache/maven-test-plugin-1.6.2/plugin.jelly:181:54:
> <fail> There were test failures.
> Total time: 3 minutes 47 seconds
> Finished at: Fri Dec 24 01:21:52 PST 2004
> 
> 



Mime
View raw message